[Swift CI] Build Still Failing: OSS - Swift Package - Ubuntu 16.10 (swift 4.1) #291

Hi,

Does anyone know whats going on here? We started seeing this after re-branching swift-4.1-branch from master yesterday.

ninja: error: '/home/buildnode/jenkins/workspace/oss-swift-4.1-package-linux-ubuntu-16_10/build/buildbot_linux/swift-linux-x86_64/lib/swift/linux/x86_64/swift_begin.o', needed by '../build/buildbot_linux/foundation-linux-x86_64/Foundation/libFoundation.so', missing and no known rule to make it
/home/buildnode/jenkins/workspace/oss-swift-4.1-package-linux-ubuntu-16_10/swift/utils/build-script: fatal error: command terminated with a non-zero exit status 1, aborting
/home/buildnode/jenkins/workspace/oss-swift-4.1-package-linux-ubuntu-16_10/swift/utils/build-script: fatal error: command terminated with a non-zero exit status 1, aborting
Build step 'Execute shell' marked build as failure

Thanks,
Mishal Shah

ยทยทยท

On Dec 5, 2017, at 8:02 PM, no-reply@swift.org wrote:

New issue found!

[FAILURE] oss-swift-4.1-package-linux-ubuntu-16_10 [#291]

Build URL: https://ci.swift.org/job/oss-swift-4.1-package-linux-ubuntu-16_10/291/
Project: oss-swift-4.1-package-linux-ubuntu-16_10
Date of build: Tue, 05 Dec 2017 21:42:43 -0600
Build duration: 20 min
Identified problems:

Compile Error: This build failed because of a compile error. Below is a list of all errors in the build log:
Indication 1 <https://ci.swift.org//job/oss-swift-4.1-package-linux-ubuntu-16_10/291/consoleFull#-19702538223122a513-f36a-4c87-8ed7-cbc36a1ec144>
Changes

Commit aed0a2f36a2e2b902677564c9123a1464825a4d6 by ankit_aggarwal:
[Commands] Use the original cwd to compute outpath

edit: Sources/Basic/PathShims.swift
edit: Sources/Build/llbuild.swift
edit: Sources/Commands/SwiftPackageTool.swift

Commit 1cd2fb66ffe6f65abeae4004051fbfbcdcd52a88 by jingham:
Swift rebranched from master, fixing a few interface changes from the

edit: source/Plugins/ExpressionParser/Swift/SwiftExpressionParser.cpp
edit: source/Plugins/ExpressionParser/Swift/SwiftASTManipulator.cpp