[Swift CI] Build Still Failing: 0. OSS - Swift Incremental RA - Ubuntu 16.04 (master) #1383

libdispatch problem:

<unknown>:0: error: cannot open file '/home/buildnode/jenkins/workspace/oss-swift-incremental-RA-linux-ubuntu-16_04/swift-corelibs-libdispatch/dispatch/module.modulemap': No such file or directory
/home/buildnode/jenkins/workspace/oss-swift-incremental-RA-linux-ubuntu-16_04/swift-corelibs-libdispatch/src/swift/Block.swift:13:8: error: no such module 'CDispatch'
import CDispatch

···

On Nov 8, 2017, at 3:57 PM, no-reply@swift.org wrote:

New issue found!

[FAILURE] oss-swift-incremental-RA-linux-ubuntu-16_04 [#1383]

Build URL: https://ci.swift.org/job/oss-swift-incremental-RA-linux-ubuntu-16_04/1383/
Project: oss-swift-incremental-RA-linux-ubuntu-16_04
Date of build: Wed, 08 Nov 2017 17:51:18 -0600
Build duration: 5 min 45 sec
Identified problems:

Compile Error: This build failed because of a compile error. Below is a list of all errors in the build log:
Indication 1 <https://ci.swift.org//job/oss-swift-incremental-RA-linux-ubuntu-16_04/1383/consoleFull#-20882572583122a513-f36a-4c87-8ed7-cbc36a1ec144&gt;
Tests:

Name: Swift(linux-x86_64)
Failed: 0 test(s), Passed: 10036 test(s), Total: 10036 test(s)
Name: Swift-Unit
Failed: 0 test(s), Passed: 486 test(s), Total: 486 test(s)

Changes

Commit b6f92700235e10207384886f8155faf3123ec1f6 by anemet:
Don't emit optimization remarks if we don't have a debug location

edit: lib/SIL/OptimizationRemark.cpp

This should resolve it, merged few mins ago.

https://github.com/apple/swift/pull/12736

Thanks,
Mishal Shah

···

On Nov 8, 2017, at 3:57 PM, Pavel Yaskevich <pyaskevich@apple.com> wrote:

libdispatch problem:

<unknown>:0: error: cannot open file '/home/buildnode/jenkins/workspace/oss-swift-incremental-RA-linux-ubuntu-16_04/swift-corelibs-libdispatch/dispatch/module.modulemap': No such file or directory
/home/buildnode/jenkins/workspace/oss-swift-incremental-RA-linux-ubuntu-16_04/swift-corelibs-libdispatch/src/swift/Block.swift:13:8: error: no such module 'CDispatch'
import CDispatch

On Nov 8, 2017, at 3:57 PM, no-reply@swift.org <mailto:no-reply@swift.org> wrote:

New issue found!

[FAILURE] oss-swift-incremental-RA-linux-ubuntu-16_04 [#1383]

Build URL: https://ci.swift.org/job/oss-swift-incremental-RA-linux-ubuntu-16_04/1383/
Project: oss-swift-incremental-RA-linux-ubuntu-16_04
Date of build: Wed, 08 Nov 2017 17:51:18 -0600
Build duration: 5 min 45 sec
Identified problems:

Compile Error: This build failed because of a compile error. Below is a list of all errors in the build log:
Indication 1 <https://ci.swift.org//job/oss-swift-incremental-RA-linux-ubuntu-16_04/1383/consoleFull#-20882572583122a513-f36a-4c87-8ed7-cbc36a1ec144&gt;
Tests:

Name: Swift(linux-x86_64)
Failed: 0 test(s), Passed: 10036 test(s), Total: 10036 test(s)
Name: Swift-Unit
Failed: 0 test(s), Passed: 486 test(s), Total: 486 test(s)

Changes

Commit b6f92700235e10207384886f8155faf3123ec1f6 by anemet:
Don't emit optimization remarks if we don't have a debug location

edit: lib/SIL/OptimizationRemark.cpp