[Swift CI] Build Still Failing: 0. OSS - Swift Incremental RA - Ubuntu 14.04 (master) #7678


(Douglas Gregor) #1

estFoundation/TestNSURLSession.swift:40: error: TestURLSession.test_dataTaskWithURL : Asynchronous wait failed - Exceeded timeout of 12.0 seconds, with unfulfilled expectations: data task
TestFoundation/TestNSURLSession.swift:42: error: Te

···

On Sep 27, 2016, at 9:37 PM, no-reply@swift.org wrote:

New issue found!

[FAILURE] oss-swift-incremental-RA-linux-ubuntu-14_04 [#7678]

Build URL: https://ci.swift.org/job/oss-swift-incremental-RA-linux-ubuntu-14_04/7678/
Project: oss-swift-incremental-RA-linux-ubuntu-14_04
Date of build: Tue, 27 Sep 2016 21:03:24 -0700
Build duration: 33 min
Identified problems:

Compile Error: This build failed because of a compile error. Below is a list of all errors in the build log:
Indication 1 <https://ci.swift.org//job/oss-swift-incremental-RA-linux-ubuntu-14_04/7678/consoleFull#1312037437ee1a197b-acac-4b17-83cf-a53b95139a76>
Tests:

Name: Swift(linux-x86_64)
Failed: 0 test(s), Passed: 8355 test(s), Total: 8355 test(s)
Name: Swift-Unit
Failed: 0 test(s), Passed: 297 test(s), Total: 297 test(s)

Changes

Commit c9be461d8a2832e9307d104eb62239397b3ba9c0 by dgregor:
[API Notes] Use std::make_tuple to unbreak libstdc++ build.

edit: lib/APINotes/APINotesWriter.cpp


(Mishal Shah) #2

HI Tony,

Is this PR ready to be merged? It might help resolve this failure.

https://github.com/apple/swift-corelibs-foundation/pull/613

Thanks,
Mishal Shah

···

On Sep 27, 2016, at 9:36 PM, Douglas Gregor <dgregor@apple.com> wrote:

estFoundation/TestNSURLSession.swift:40: error: TestURLSession.test_dataTaskWithURL : Asynchronous wait failed - Exceeded timeout of 12.0 seconds, with unfulfilled expectations: data task
TestFoundation/TestNSURLSession.swift:42: error: Te

On Sep 27, 2016, at 9:37 PM, no-reply@swift.org <mailto:no-reply@swift.org> wrote:

New issue found!

[FAILURE] oss-swift-incremental-RA-linux-ubuntu-14_04 [#7678]

Build URL: https://ci.swift.org/job/oss-swift-incremental-RA-linux-ubuntu-14_04/7678/
Project: oss-swift-incremental-RA-linux-ubuntu-14_04
Date of build: Tue, 27 Sep 2016 21:03:24 -0700
Build duration: 33 min
Identified problems:

Compile Error: This build failed because of a compile error. Below is a list of all errors in the build log:
Indication 1 <https://ci.swift.org//job/oss-swift-incremental-RA-linux-ubuntu-14_04/7678/consoleFull#1312037437ee1a197b-acac-4b17-83cf-a53b95139a76>
Tests:

Name: Swift(linux-x86_64)
Failed: 0 test(s), Passed: 8355 test(s), Total: 8355 test(s)
Name: Swift-Unit
Failed: 0 test(s), Passed: 297 test(s), Total: 297 test(s)

Changes

Commit c9be461d8a2832e9307d104eb62239397b3ba9c0 by dgregor:
[API Notes] Use std::make_tuple to unbreak libstdc++ build.

edit: lib/APINotes/APINotesWriter.cpp


(Tony Parker) #3

I merged the PR. Hopefully that will help quite a bit with these.

- Tony

···

On Sep 27, 2016, at 10:26 PM, mishal_shah <mishal_shah@apple.com> wrote:

HI Tony,

Is this PR ready to be merged? It might help resolve this failure.

https://github.com/apple/swift-corelibs-foundation/pull/613

Thanks,
Mishal Shah

On Sep 27, 2016, at 9:36 PM, Douglas Gregor <dgregor@apple.com <mailto:dgregor@apple.com>> wrote:

estFoundation/TestNSURLSession.swift:40: error: TestURLSession.test_dataTaskWithURL : Asynchronous wait failed - Exceeded timeout of 12.0 seconds, with unfulfilled expectations: data task
TestFoundation/TestNSURLSession.swift:42: error: Te

On Sep 27, 2016, at 9:37 PM, no-reply@swift.org <mailto:no-reply@swift.org> wrote:

New issue found!

[FAILURE] oss-swift-incremental-RA-linux-ubuntu-14_04 [#7678]

Build URL: https://ci.swift.org/job/oss-swift-incremental-RA-linux-ubuntu-14_04/7678/
Project: oss-swift-incremental-RA-linux-ubuntu-14_04
Date of build: Tue, 27 Sep 2016 21:03:24 -0700
Build duration: 33 min
Identified problems:

Compile Error: This build failed because of a compile error. Below is a list of all errors in the build log:
Indication 1 <https://ci.swift.org//job/oss-swift-incremental-RA-linux-ubuntu-14_04/7678/consoleFull#1312037437ee1a197b-acac-4b17-83cf-a53b95139a76>
Tests:

Name: Swift(linux-x86_64)
Failed: 0 test(s), Passed: 8355 test(s), Total: 8355 test(s)
Name: Swift-Unit
Failed: 0 test(s), Passed: 297 test(s), Total: 297 test(s)

Changes

Commit c9be461d8a2832e9307d104eb62239397b3ba9c0 by dgregor:
[API Notes] Use std::make_tuple to unbreak libstdc++ build.

edit: lib/APINotes/APINotesWriter.cpp


#4

It seems https://restcountries.eu is down now

https://github.com/fayder/restcountries/issues/32

···

2016-09-28 14:26 GMT+09:00 mishal_shah via swift-dev <swift-dev@swift.org>:

HI Tony,

Is this PR ready to be merged? It might help resolve this failure.

https://github.com/apple/swift-corelibs-foundation/pull/613

Thanks,
Mishal Shah

On Sep 27, 2016, at 9:36 PM, Douglas Gregor <dgregor@apple.com> wrote:

estFoundation/TestNSURLSession.swift:40: error: TestURLSession.test_dataTaskWithURL
: Asynchronous wait failed - Exceeded timeout of 12.0 seconds, with
unfulfilled expectations: data task TestFoundation/TestNSURLSession.swift:42:
error: Te

On Sep 27, 2016, at 9:37 PM, no-reply@swift.org wrote:

New issue found![FAILURE] oss-swift-incremental-RA-linux-ubuntu-14_04
[#7678]
Build URL: https://ci.swift.org/job/oss-swift-incremental-RA-linux-
ubuntu-14_04/7678/
Project: oss-swift-incremental-RA-linux-ubuntu-14_04
Date of build: Tue, 27 Sep 2016 21:03:24 -0700
Build duration: 33 minIdentified problems:

   - Compile Error: This build failed because of a compile error. Below
   is a list of all errors in the build log:
      - Indication 1
      <https://ci.swift.org//job/oss-swift-incremental-RA-linux-ubuntu-14_04/7678/consoleFull#1312037437ee1a197b-acac-4b17-83cf-a53b95139a76>

Tests:
Name: *Swift(linux-x86_64)*
Failed: 0 test(s), Passed: 8355 test(s), Total: 8355 test(s)
Name: *Swift-Unit*
Failed: 0 test(s), Passed: 297 test(s), Total: 297 test(s)

Changes

   - Commit *c9be461d8a2832e9307d104eb62239397b3ba9c0* by *dgregor:*

   [API Notes] Use std::make_tuple to unbreak libstdc++ build.
   - *edit*: lib/APINotes/APINotesWriter.cpp

_______________________________________________
swift-dev mailing list
swift-dev@swift.org
https://lists.swift.org/mailman/listinfo/swift-dev


(Mishal Shah) #5

Thanks!

···

On Sep 28, 2016, at 9:09 AM, Tony Parker <anthony.parker@apple.com> wrote:

I merged the PR. Hopefully that will help quite a bit with these.

- Tony

On Sep 27, 2016, at 10:26 PM, mishal_shah <mishal_shah@apple.com <mailto:mishal_shah@apple.com>> wrote:

HI Tony,

Is this PR ready to be merged? It might help resolve this failure.

https://github.com/apple/swift-corelibs-foundation/pull/613

Thanks,
Mishal Shah

On Sep 27, 2016, at 9:36 PM, Douglas Gregor <dgregor@apple.com <mailto:dgregor@apple.com>> wrote:

estFoundation/TestNSURLSession.swift:40: error: TestURLSession.test_dataTaskWithURL : Asynchronous wait failed - Exceeded timeout of 12.0 seconds, with unfulfilled expectations: data task
TestFoundation/TestNSURLSession.swift:42: error: Te

On Sep 27, 2016, at 9:37 PM, no-reply@swift.org <mailto:no-reply@swift.org> wrote:

New issue found!

[FAILURE] oss-swift-incremental-RA-linux-ubuntu-14_04 [#7678]

Build URL: https://ci.swift.org/job/oss-swift-incremental-RA-linux-ubuntu-14_04/7678/
Project: oss-swift-incremental-RA-linux-ubuntu-14_04
Date of build: Tue, 27 Sep 2016 21:03:24 -0700
Build duration: 33 min
Identified problems:

Compile Error: This build failed because of a compile error. Below is a list of all errors in the build log:
Indication 1 <https://ci.swift.org//job/oss-swift-incremental-RA-linux-ubuntu-14_04/7678/consoleFull#1312037437ee1a197b-acac-4b17-83cf-a53b95139a76>
Tests:

Name: Swift(linux-x86_64)
Failed: 0 test(s), Passed: 8355 test(s), Total: 8355 test(s)
Name: Swift-Unit
Failed: 0 test(s), Passed: 297 test(s), Total: 297 test(s)

Changes

Commit c9be461d8a2832e9307d104eb62239397b3ba9c0 by dgregor:
[API Notes] Use std::make_tuple to unbreak libstdc++ build.

edit: lib/APINotes/APINotesWriter.cpp