[Swift CI] Build Still Failing: 0. OSS - Swift Incremental RA - Ubuntu 14.04 (master) #1174

Test Case 'TestNSNumberBridging.testNSNumberBridgeFromFloat' started at 2017-10-17 21:14:51.197
<>TestFoundation/TestNSNumberBridging.swift:72: error: TestNSNumberBridging.testNSNumberBridgeFromFloat : failed - TestFoundation/TestNSNumberBridging.swift:497 nil != Optional(nan) Double
<>TestFoundation/TestNSNumberBridging.swift:72: error: TestNSNumberBridging.testNSNumberBridgeFromFloat : failed - TestFoundation/TestNSNumberBridging.swift:497 nil != Optional(nan) Double
Test Case 'TestNSNumberBridging.testNSNumberBridgeFromFloat' failed (0.001 seconds)

···

On 17-Oct-2017, at 2:15 PM, no-reply@swift.org wrote:

New issue found!

[FAILURE] oss-swift-incremental-RA-linux-ubuntu-14_04 [#1174]

Build URL: https://ci.swift.org/job/oss-swift-incremental-RA-linux-ubuntu-14_04/1174/
Project: oss-swift-incremental-RA-linux-ubuntu-14_04
Date of build: Tue, 17 Oct 2017 15:52:12 -0500
Build duration: 24 min
Identified problems:

Compile Error: This build failed because of a compile error. Below is a list of all errors in the build log:
Indication 1 <https://ci.swift.org//job/oss-swift-incremental-RA-linux-ubuntu-14_04/1174/consoleFull#13507271083122a513-f36a-4c87-8ed7-cbc36a1ec144>
Changes

Commit 85b98c6784d2c5cfa0c25c2e08f23df192ebaa33 by ankit_aggarwal:
[BuildPlan] Move -X* args to the end of the constructed args

edit: Sources/Build/BuildPlan.swift

--
Ankit

Is this still an issue?

This Foundation test failure is blocking PR testing! This needs to be fixed ASAP or XFAILED.

Can you guys fix this now please.

Michael

···

On Oct 17, 2017, at 2:24 PM, Ankit Aggarwal via swift-dev <swift-dev@swift.org> wrote:

Test Case 'TestNSNumberBridging.testNSNumberBridgeFromFloat' started at 2017-10-17 21:14:51.197
<>TestFoundation/TestNSNumberBridging.swift:72: error: TestNSNumberBridging.testNSNumberBridgeFromFloat : failed - TestFoundation/TestNSNumberBridging.swift:497 nil != Optional(nan) Double
<>TestFoundation/TestNSNumberBridging.swift:72: error: TestNSNumberBridging.testNSNumberBridgeFromFloat : failed - TestFoundation/TestNSNumberBridging.swift:497 nil != Optional(nan) Double
Test Case 'TestNSNumberBridging.testNSNumberBridgeFromFloat' failed (0.001 seconds)

On 17-Oct-2017, at 2:15 PM, no-reply@swift.org <mailto:no-reply@swift.org> wrote:

New issue found!

[FAILURE] oss-swift-incremental-RA-linux-ubuntu-14_04 [#1174]

Build URL: https://ci.swift.org/job/oss-swift-incremental-RA-linux-ubuntu-14_04/1174/
Project: oss-swift-incremental-RA-linux-ubuntu-14_04
Date of build: Tue, 17 Oct 2017 15:52:12 -0500
Build duration: 24 min
Identified problems:

Compile Error: This build failed because of a compile error. Below is a list of all errors in the build log:
Indication 1 <https://ci.swift.org//job/oss-swift-incremental-RA-linux-ubuntu-14_04/1174/consoleFull#13507271083122a513-f36a-4c87-8ed7-cbc36a1ec144>
Changes

Commit 85b98c6784d2c5cfa0c25c2e08f23df192ebaa33 by ankit_aggarwal:
[BuildPlan] Move -X* args to the end of the constructed args

edit: Sources/Build/BuildPlan.swift

--
Ankit

_______________________________________________
swift-dev mailing list
swift-dev@swift.org
https://lists.swift.org/mailman/listinfo/swift-dev