[Swift CI] Build Still Failing: 0. OSS - LLDB Incremental - OS X (master) #456

It doesn’t look like it could be caused by my changes in type-checker:

AssertionError: False is not True : No locations found for source breakpoint: "break"

···

On Nov 30, 2017, at 6:41 AM, no-reply@swift.org wrote:

New issue found!

[FAILURE] oss-lldb-incremental-osx [#456]

Build URL: https://ci.swift.org/job/oss-lldb-incremental-osx/456/
Project: oss-lldb-incremental-osx
Date of build: Thu, 30 Nov 2017 07:40:11 -0600
Build duration: 1 hr 0 min
Identified problems:

Regression test failed: This build failed because a regression test in the test suite FAILed. Below is a list of all errors:
Indication 1 <https://ci.swift.org//job/oss-lldb-incremental-osx/456/consoleFull#264999214ba62d58e-7248-467b-91e0-c7508d5cf947&gt;
Changes

Commit 0783890b0351dfddc5082f0f34505daef81a1ae3 by pyaskevich:
[CSGen] Fix `LinkedExprAnalyzer` greedy operator linking

edit: test/Constraints/operator.swift
edit: lib/Sema/CSGen.cpp

<rdar://problem/35774408> Swift CI: expression_command/save_jit_objects/TestSaveJITObjects.py fails

···

On Nov 30, 2017, at 9:42 AM, Pavel Yaskevich <pyaskevich@apple.com> wrote:

It doesn’t look like it could be caused by my changes in type-checker:

AssertionError: False is not True : No locations found for source breakpoint: "break"

On Nov 30, 2017, at 6:41 AM, no-reply@swift.org <mailto:no-reply@swift.org> wrote:

New issue found!

[FAILURE] oss-lldb-incremental-osx [#456]

Build URL: https://ci.swift.org/job/oss-lldb-incremental-osx/456/
Project: oss-lldb-incremental-osx
Date of build: Thu, 30 Nov 2017 07:40:11 -0600
Build duration: 1 hr 0 min
Identified problems:

Regression test failed: This build failed because a regression test in the test suite FAILed. Below is a list of all errors:
Indication 1 <https://ci.swift.org//job/oss-lldb-incremental-osx/456/consoleFull#264999214ba62d58e-7248-467b-91e0-c7508d5cf947&gt;
Changes

Commit 0783890b0351dfddc5082f0f34505daef81a1ae3 by pyaskevich:
[CSGen] Fix `LinkedExprAnalyzer` greedy operator linking

edit: test/Constraints/operator.swift
edit: lib/Sema/CSGen.cpp

<rdar://problem/35774408 <rdar://problem/35774408>> Swift CI: expression_command/save_jit_objects/TestSaveJITObjects.py fails

Saw that, thanks, Arnold!

···

On Nov 30, 2017, at 9:43 AM, Arnold Schwaighofer <aschwaighofer@apple.com> wrote:

On Nov 30, 2017, at 9:42 AM, Pavel Yaskevich <pyaskevich@apple.com <mailto:pyaskevich@apple.com>> wrote:

It doesn’t look like it could be caused by my changes in type-checker:

AssertionError: False is not True : No locations found for source breakpoint: "break"

On Nov 30, 2017, at 6:41 AM, no-reply@swift.org <mailto:no-reply@swift.org> wrote:

New issue found!

[FAILURE] oss-lldb-incremental-osx [#456]

Build URL: https://ci.swift.org/job/oss-lldb-incremental-osx/456/
Project: oss-lldb-incremental-osx
Date of build: Thu, 30 Nov 2017 07:40:11 -0600
Build duration: 1 hr 0 min
Identified problems:

Regression test failed: This build failed because a regression test in the test suite FAILed. Below is a list of all errors:
Indication 1 <https://ci.swift.org//job/oss-lldb-incremental-osx/456/consoleFull#264999214ba62d58e-7248-467b-91e0-c7508d5cf947&gt;
Changes

Commit 0783890b0351dfddc5082f0f34505daef81a1ae3 by pyaskevich:
[CSGen] Fix `LinkedExprAnalyzer` greedy operator linking

edit: test/Constraints/operator.swift
edit: lib/Sema/CSGen.cpp