[Swift CI] Build Failure: 0. OSS - Swift Incremental RA - Ubuntu 16.10 (master) #1892


(Jordan Rose) #1

clang-4.0: error: unable to execute command: Bus error
clang-4.0: error: linker command failed due to signal (use -v to see invocation)

This pretty much can't be Arnold's commit. I'm going to wait a build to see if it happens again.

Jordan

···

On Feb 13, 2017, at 13:25, no-reply@swift.org wrote:

[FAILURE] oss-swift-incremental-RA-linux-ubuntu-16_10 [#1892]

Build URL: https://ci.swift.org/job/oss-swift-incremental-RA-linux-ubuntu-16_10/1892/
Project: oss-swift-incremental-RA-linux-ubuntu-16_10
Date of build: Mon, 13 Feb 2017 13:12:16 -0800
Build duration: 13 min
Identified problems:

Compile Error: This build failed because of a compile error. Below is a list of all errors in the build log:
Indication 1 <https://ci.swift.org//job/oss-swift-incremental-RA-linux-ubuntu-16_10/1892/consoleFull#-1839951704ee1a197b-acac-4b17-83cf-a53b95139a76>
Regression test failed: This build failed because a regression test in the test suite FAILed. Below is a list of all errors:
Indication 1 <https://ci.swift.org//job/oss-swift-incremental-RA-linux-ubuntu-16_10/1892/consoleFull#-1112719381fca400bf-2f4a-462e-b517-e058d770b2d7>
Tests:

Name: Swift(linux-x86_64)
Failed: 1 test(s), Passed: 8964 test(s), Total: 8965 test(s)
Failed: Swift(linux-x86_64).AutolinkExtract.import_archive.swift <https://ci.swift.org/job/oss-swift-incremental-RA-linux-ubuntu-16_10/1892/testReport/junit/Swift(linux-x86_64)/AutolinkExtract/import_archive_swift>
Name: Swift-Unit
Failed: 0 test(s), Passed: 307 test(s), Total: 307 test(s)

Changes

Commit 7ea00ab6d76ed49176bf57b55ad6342d4a83d592 by aschwaighofer:
swiftcc: Don't emit tail calls from callers with swifterror parameters

edit: test/CodeGen/AArch64/swifterror.ll
edit: test/CodeGen/ARM/swifterror.ll
edit: lib/CodeGen/SelectionDAG/SelectionDAGBuilder.cpp
edit: test/CodeGen/X86/swifterror.ll


(Slava Pestov) #2

I’ve seen this before. It would be useful if we kept all old CI logs in an easily searchable form.

Slava

···

On Feb 13, 2017, at 1:28 PM, Jordan Rose via swift-dev <swift-dev@swift.org> wrote:

clang-4.0: error: unable to execute command: Bus error
clang-4.0: error: linker command failed due to signal (use -v to see invocation)

This pretty much can't be Arnold's commit. I'm going to wait a build to see if it happens again.

Jordan

On Feb 13, 2017, at 13:25, no-reply@swift.org <mailto:no-reply@swift.org> wrote:

[FAILURE] oss-swift-incremental-RA-linux-ubuntu-16_10 [#1892]

Build URL: https://ci.swift.org/job/oss-swift-incremental-RA-linux-ubuntu-16_10/1892/
Project: oss-swift-incremental-RA-linux-ubuntu-16_10
Date of build: Mon, 13 Feb 2017 13:12:16 -0800
Build duration: 13 min
Identified problems:

Compile Error: This build failed because of a compile error. Below is a list of all errors in the build log:
Indication 1 <https://ci.swift.org//job/oss-swift-incremental-RA-linux-ubuntu-16_10/1892/consoleFull#-1839951704ee1a197b-acac-4b17-83cf-a53b95139a76>
Regression test failed: This build failed because a regression test in the test suite FAILed. Below is a list of all errors:
Indication 1 <https://ci.swift.org//job/oss-swift-incremental-RA-linux-ubuntu-16_10/1892/consoleFull#-1112719381fca400bf-2f4a-462e-b517-e058d770b2d7>
Tests:

Name: Swift(linux-x86_64)
Failed: 1 test(s), Passed: 8964 test(s), Total: 8965 test(s)
Failed: Swift(linux-x86_64).AutolinkExtract.import_archive.swift <https://ci.swift.org/job/oss-swift-incremental-RA-linux-ubuntu-16_10/1892/testReport/junit/Swift(linux-x86_64)/AutolinkExtract/import_archive_swift>
Name: Swift-Unit
Failed: 0 test(s), Passed: 307 test(s), Total: 307 test(s)

Changes

Commit 7ea00ab6d76ed49176bf57b55ad6342d4a83d592 by aschwaighofer:
swiftcc: Don't emit tail calls from callers with swifterror parameters

edit: test/CodeGen/AArch64/swifterror.ll
edit: test/CodeGen/ARM/swifterror.ll
edit: lib/CodeGen/SelectionDAG/SelectionDAGBuilder.cpp
edit: test/CodeGen/X86/swifterror.ll

_______________________________________________
swift-dev mailing list
swift-dev@swift.org
https://lists.swift.org/mailman/listinfo/swift-dev


#3

Should I file a JIRA?
https://lists.swift.org/pipermail/swift-dev/Week-of-Mon-20170109/003828.html

Rintaro

···

2017-02-14 10:19 GMT+09:00 Slava Pestov via swift-dev <swift-dev@swift.org>:

I’ve seen this before. It would be useful if we kept all old CI logs in an
easily searchable form.

Slava

On Feb 13, 2017, at 1:28 PM, Jordan Rose via swift-dev < > swift-dev@swift.org> wrote:

clang-4.0: error: unable to execute command: Bus error
clang-4.0: error: linker command failed due to signal (use -v to see invocation)

This pretty much can't be Arnold's commit. I'm going to wait a build to
see if it happens again.

Jordan

On Feb 13, 2017, at 13:25, no-reply@swift.org wrote:

[FAILURE] oss-swift-incremental-RA-linux-ubuntu-16_10 [#1892]
Build URL: https://ci.swift.org/job/oss-swift-incremental-RA-linux-
ubuntu-16_10/1892/
Project: oss-swift-incremental-RA-linux-ubuntu-16_10
Date of build: Mon, 13 Feb 2017 13:12:16 -0800
Build duration: 13 minIdentified problems:

   - Compile Error: This build failed because of a compile error. Below
   is a list of all errors in the build log:
      - Indication 1
      <https://ci.swift.org//job/oss-swift-incremental-RA-linux-ubuntu-16_10/1892/consoleFull#-1839951704ee1a197b-acac-4b17-83cf-a53b95139a76>
   - Regression test failed: This build failed because a regression test
   in the test suite FAILed. Below is a list of all errors:
      - Indication 1
      <https://ci.swift.org//job/oss-swift-incremental-RA-linux-ubuntu-16_10/1892/consoleFull#-1112719381fca400bf-2f4a-462e-b517-e058d770b2d7>

Tests:
Name: *Swift(linux-x86_64)*
Failed: 1 test(s), Passed: 8964 test(s), Total: 8965 test(s)

* - Failed: Swift(linux-x86_64).AutolinkExtract.import_archive.swift
<https://ci.swift.org/job/oss-swift-incremental-RA-linux-ubuntu-16_10/1892/testReport/junit/Swift(linux-x86_64)/AutolinkExtract/import_archive_swift>*
Name: *Swift-Unit*
Failed: 0 test(s), Passed: 307 test(s), Total: 307 test(s)

Changes

   - Commit *7ea00ab6d76ed49176bf57b55ad6342d4a83d592* by *aschwaighofer:*

   swiftcc: Don't emit tail calls from callers with swifterror parameters
   - *edit*: test/CodeGen/AArch64/swifterror.ll
      - *edit*: test/CodeGen/ARM/swifterror.ll
      - *edit*: lib/CodeGen/SelectionDAG/SelectionDAGBuilder.cpp
      - *edit*: test/CodeGen/X86/swifterror.ll

_______________________________________________
swift-dev mailing list
swift-dev@swift.org
https://lists.swift.org/mailman/listinfo/swift-dev

_______________________________________________
swift-dev mailing list
swift-dev@swift.org
https://lists.swift.org/mailman/listinfo/swift-dev