[Swift CI] Build Failure: 0. OSS - Swift Incremental RA - Ubuntu 16.04 (swift 4.2) #900


[FAILURE] oss-swift-4.2-incremental-RA-linux-ubuntu-16_04 [#900]

Build URL:
Date of build:
Thu, 17 May 2018 02:59:16 -0500
Build duration:
48 min

Identified problems:

  • Compile Error: This build failed because of a compile error. Below is a list of all errors in the build log:
  • Regression test failed: This build failed because a regression test in the test suite FAILed. Below is a list of all errors:


Name: Swift(linux-x86_64)
Failed: 1 test(s), Passed: 10526 test(s), Total: 10527 test(s)

clang-6.0: error: unable to execute command: Bus error (core dumped) clang-6.0: error: linker command failed due to signal (use -v to see invocation) <unknown>:0: error: link command failed with exit code 254 (use -v to see invocation)

Looks unrelated to my type-checker changes.

New issue found!