[Swift CI] Build Failure: 0. OSS - Swift Incremental RA - Ubuntu 15.10 (master) #4134


(David Farler) #1

/home/buildnode/jenkins/workspace/oss-swift-incremental-RA-linux-ubuntu-15_10/swiftpm/Tests/PackageType/PackageNameTests.swift:12:8: error: no such module 'XCTest'

import XCTest
       ^

Mishal, have you seen this one before? This looks unrelated to my change.

David

···

On Apr 11, 2016, at 11:48 PM, no-reply@swift.org wrote:

[FAILURE] oss-swift-incremental-RA-linux-ubuntu-15_10 [#4134]

Build URL: https://ci.swift.org/job/oss-swift-incremental-RA-linux-ubuntu-15_10/4134/
Project: oss-swift-incremental-RA-linux-ubuntu-15_10
Date of build: Mon, 11 Apr 2016 23:40:23 -0700
Build duration: 7 min 50 sec
Identified problems:

Compile Error: This build failed because of a compile error. Below is a list of all errors in the build log:
Indication 1 <https://ci.swift.org//job/oss-swift-incremental-RA-linux-ubuntu-15_10/4134/consoleFull#-1748781765ee1a197b-acac-4b17-83cf-a53b95139a76>
Tests:

Name: Swift
Failed: 0 test(s), Passed: 7800 test(s), Total: 7800 test(s)
Name: Swift-Unit
Failed: 0 test(s), Passed: 256 test(s), Total: 256 test(s)

Changes

Commit 90d29340a0da8aca7e6e4a5f82c70f575361cc53 by dfarler:
Add full SwiftRemoteMirror C API

edit: include/swift/SwiftRemoteMirror/SwiftRemoteMirror.h

Commit 9863e4996859aaca659620ce1f9c05bc8e165faa by dfarler:
Add SwiftRemoteMirror implementation for addReflectionInfo

edit: stdlib/public/SwiftRemoteMirror/SwiftRemoteMirror.cpp

Commit ec4f1fd22bccf272bad5b1a8fd654285b5f938ef by dfarler:
Use external but native runtime target template for SwiftRemoteMirror

edit: stdlib/public/SwiftRemoteMirror/SwiftRemoteMirror.cpp

Commit 67943c437b4aed98339a4b1221d2b4bd84444c0b by dfarler:
SwiftRemoteMirrors: Implementationsfor

edit: stdlib/public/SwiftRemoteMirror/SwiftRemoteMirror.cpp

Commit 0b04b908955f8a41728357cf30b2b5394caa36c9 by dfarler:
SwiftRemoteMirrors: Stub implementations for infoFor{TypeRef,Field}

edit: include/swift/Reflection/ReflectionContext.h
edit: stdlib/public/SwiftRemoteMirror/SwiftRemoteMirror.cpp
add: include/swift/SwiftRemoteMirror/SwiftRemoteMirrorTypes.h
edit: include/swift/SwiftRemoteMirror/SwiftRemoteMirror.h

Commit f6d09edde9b1ea7273847cc71c9f2a81999844c2 by harlan:
[coverage] Ignore compiler_crashers for coverage tests

edit: test/lit.cfg


(Mishal Shah) #2

Hi David,

I had removed --foundation because we were preparing for SR-0055, next build should be blue.

Thanks,
Mishal Shah

···

On Apr 11, 2016, at 11:49 PM, David Farler <dfarler@apple.com> wrote:

/home/buildnode/jenkins/workspace/oss-swift-incremental-RA-linux-ubuntu-15_10/swiftpm/Tests/PackageType/PackageNameTests.swift:12:8: error: no such module 'XCTest'

import XCTest
       ^

Mishal, have you seen this one before? This looks unrelated to my change.

David

On Apr 11, 2016, at 11:48 PM, no-reply@swift.org <mailto:no-reply@swift.org> wrote:

[FAILURE] oss-swift-incremental-RA-linux-ubuntu-15_10 [#4134]

Build URL: https://ci.swift.org/job/oss-swift-incremental-RA-linux-ubuntu-15_10/4134/
Project: oss-swift-incremental-RA-linux-ubuntu-15_10
Date of build: Mon, 11 Apr 2016 23:40:23 -0700
Build duration: 7 min 50 sec
Identified problems:

Compile Error: This build failed because of a compile error. Below is a list of all errors in the build log:
Indication 1 <https://ci.swift.org//job/oss-swift-incremental-RA-linux-ubuntu-15_10/4134/consoleFull#-1748781765ee1a197b-acac-4b17-83cf-a53b95139a76>
Tests:

Name: Swift
Failed: 0 test(s), Passed: 7800 test(s), Total: 7800 test(s)
Name: Swift-Unit
Failed: 0 test(s), Passed: 256 test(s), Total: 256 test(s)

Changes

Commit 90d29340a0da8aca7e6e4a5f82c70f575361cc53 by dfarler:
Add full SwiftRemoteMirror C API

edit: include/swift/SwiftRemoteMirror/SwiftRemoteMirror.h

Commit 9863e4996859aaca659620ce1f9c05bc8e165faa by dfarler:
Add SwiftRemoteMirror implementation for addReflectionInfo

edit: stdlib/public/SwiftRemoteMirror/SwiftRemoteMirror.cpp

Commit ec4f1fd22bccf272bad5b1a8fd654285b5f938ef by dfarler:
Use external but native runtime target template for SwiftRemoteMirror

edit: stdlib/public/SwiftRemoteMirror/SwiftRemoteMirror.cpp

Commit 67943c437b4aed98339a4b1221d2b4bd84444c0b by dfarler:
SwiftRemoteMirrors: Implementationsfor

edit: stdlib/public/SwiftRemoteMirror/SwiftRemoteMirror.cpp

Commit 0b04b908955f8a41728357cf30b2b5394caa36c9 by dfarler:
SwiftRemoteMirrors: Stub implementations for infoFor{TypeRef,Field}

edit: include/swift/Reflection/ReflectionContext.h
edit: stdlib/public/SwiftRemoteMirror/SwiftRemoteMirror.cpp
add: include/swift/SwiftRemoteMirror/SwiftRemoteMirrorTypes.h
edit: include/swift/SwiftRemoteMirror/SwiftRemoteMirror.h

Commit f6d09edde9b1ea7273847cc71c9f2a81999844c2 by harlan:
[coverage] Ignore compiler_crashers for coverage tests

edit: test/lit.cfg