[Swift CI] Build Failure: 0. OSS - Swift Incremental RA - Ubuntu 14.04 (master) #7230


(Anders Bertelrud) #1

Looks unrelated to the checkins mentioned in this email:

Test Case 'TestNSHTTPURLResponse.test_MIMETypeAndCharacterEncoding_1' passed (0.0 seconds).
Test Case 'TestNSHTTPURLResponse.test_MIMETypeAndCharacterEncoding_2' started at 20:30:25.699
Test Case 'TestNSHTTPURLResponse.test_MIMETypeAndCharacterEncoding_2' passed (0.0 seconds).
Test Case 'TestNSHTTPURLResponse.test_MIMETypeAndCharacterEncoding_3' started at 20:30:25.699
Test Case 'TestNSHTTPURLResponse.test_MIMETypeAndCharacterEncoding_3' passed (0.0 seconds).
Test Suite 'TestNSHTTPURLResponse' passed at 20:30:25.699
   Executed 25 tests, with 0 failures (0 unexpected) in 0.003 (0.003) seconds
Test Suite 'TestURLSession' started at 20:30:25.699
Test Case 'TestURLSession.test_dataTaskWithURL' started at 20:30:25.699

Build timed out (after 45 minutes). Marking the build as failed.

Build was aborted

Anders

···

On 2016-08-31, at 14.15, no-reply@swift.org wrote:

[FAILURE] oss-swift-incremental-RA-linux-ubuntu-14_04 [#7230]

Build URL: https://ci.swift.org/job/oss-swift-incremental-RA-linux-ubuntu-14_04/7230/
Project: oss-swift-incremental-RA-linux-ubuntu-14_04
Date of build: Wed, 31 Aug 2016 13:03:22 -0700
Build duration: 1 hr 12 min
Identified problems:

Timeout: This build was marked as FAIL because it timed out.
Indication 1 <https://ci.swift.org//job/oss-swift-incremental-RA-linux-ubuntu-14_04/7230/consoleFull#89513194756633f0f-8823-4f82-9a4a-0c0d97ce7760>
Tests:

Name: Swift(linux-x86_64)
Failed: 0 test(s), Passed: 8279 test(s), Total: 8279 test(s)
Name: Swift-Unit
Failed: 0 test(s), Passed: 230 test(s), Total: 230 test(s)

Changes

Commit 3fa09465c42941444c336acd68092362facd87a1 by nmaccharoli:
[stdlib] Move empty check for string concatenation to front

edit: stdlib/public/core/String.swift

Commit 82b37b3e7fed122150dd602e29cae966cebf494d by anders:
Check for loose source files in the `Tests` directory (it's a package

edit: Sources/PackageLoading/PackageBuilder.swift
edit: Tests/PackageLoadingTests/ConventionTests.swift


(Philippe Hausler) #2

Those tests have been disabled by https://github.com/apple/swift-corelibs-foundation/commit/b98f8d67071b0af39f85c589dfd6cb54ff7c06cd

···

Sent from my iPhone

On Aug 31, 2016, at 2:18 PM, Anders Bertelrud via swift-dev <swift-dev@swift.org> wrote:

Looks unrelated to the checkins mentioned in this email:

Test Case 'TestNSHTTPURLResponse.test_MIMETypeAndCharacterEncoding_1' passed (0.0 seconds).
Test Case 'TestNSHTTPURLResponse.test_MIMETypeAndCharacterEncoding_2' started at 20:30:25.699
Test Case 'TestNSHTTPURLResponse.test_MIMETypeAndCharacterEncoding_2' passed (0.0 seconds).
Test Case 'TestNSHTTPURLResponse.test_MIMETypeAndCharacterEncoding_3' started at 20:30:25.699
Test Case 'TestNSHTTPURLResponse.test_MIMETypeAndCharacterEncoding_3' passed (0.0 seconds).
Test Suite 'TestNSHTTPURLResponse' passed at 20:30:25.699
   Executed 25 tests, with 0 failures (0 unexpected) in 0.003 (0.003) seconds
Test Suite 'TestURLSession' started at 20:30:25.699
Test Case 'TestURLSession.test_dataTaskWithURL' started at 20:30:25.699

Build timed out (after 45 minutes). Marking the build as failed.

Build was aborted

Anders

On 2016-08-31, at 14.15, no-reply@swift.org wrote:

[FAILURE] oss-swift-incremental-RA-linux-ubuntu-14_04 [#7230]

Build URL: https://ci.swift.org/job/oss-swift-incremental-RA-linux-ubuntu-14_04/7230/
Project: oss-swift-incremental-RA-linux-ubuntu-14_04
Date of build: Wed, 31 Aug 2016 13:03:22 -0700
Build duration: 1 hr 12 min
Identified problems:

Timeout: This build was marked as FAIL because it timed out.
Indication 1
Tests:

Name: Swift(linux-x86_64)
Failed: 0 test(s), Passed: 8279 test(s), Total: 8279 test(s)
Name: Swift-Unit
Failed: 0 test(s), Passed: 230 test(s), Total: 230 test(s)

Changes

Commit 3fa09465c42941444c336acd68092362facd87a1 by nmaccharoli:
[stdlib] Move empty check for string concatenation to front

edit: stdlib/public/core/String.swift

Commit 82b37b3e7fed122150dd602e29cae966cebf494d by anders:
Check for loose source files in the `Tests` directory (it's a package

edit: Sources/PackageLoading/PackageBuilder.swift
edit: Tests/PackageLoadingTests/ConventionTests.swift

_______________________________________________
swift-dev mailing list
swift-dev@swift.org
https://lists.swift.org/mailman/listinfo/swift-dev


(Michael Gottesman) #3

Why wasn't this caught by pull request testing?

Michael

···

On Aug 31, 2016, at 3:56 PM, Philippe Hausler via swift-dev <swift-dev@swift.org> wrote:

Those tests have been disabled by https://github.com/apple/swift-corelibs-foundation/commit/b98f8d67071b0af39f85c589dfd6cb54ff7c06cd
Sent from my iPhone

On Aug 31, 2016, at 2:18 PM, Anders Bertelrud via swift-dev <swift-dev@swift.org <mailto:swift-dev@swift.org>> wrote:

Looks unrelated to the checkins mentioned in this email:

Test Case 'TestNSHTTPURLResponse.test_MIMETypeAndCharacterEncoding_1' passed (0.0 seconds).
Test Case 'TestNSHTTPURLResponse.test_MIMETypeAndCharacterEncoding_2' started at 20:30:25.699
Test Case 'TestNSHTTPURLResponse.test_MIMETypeAndCharacterEncoding_2' passed (0.0 seconds).
Test Case 'TestNSHTTPURLResponse.test_MIMETypeAndCharacterEncoding_3' started at 20:30:25.699
Test Case 'TestNSHTTPURLResponse.test_MIMETypeAndCharacterEncoding_3' passed (0.0 seconds).
Test Suite 'TestNSHTTPURLResponse' passed at 20:30:25.699
   Executed 25 tests, with 0 failures (0 unexpected) in 0.003 (0.003) seconds
Test Suite 'TestURLSession' started at 20:30:25.699
Test Case 'TestURLSession.test_dataTaskWithURL' started at 20:30:25.699

Build timed out (after 45 minutes). Marking the build as failed.

Build was aborted

Anders

On 2016-08-31, at 14.15, no-reply@swift.org <mailto:no-reply@swift.org> wrote:

[FAILURE] oss-swift-incremental-RA-linux-ubuntu-14_04 [#7230]

Build URL: https://ci.swift.org/job/oss-swift-incremental-RA-linux-ubuntu-14_04/7230/
Project: oss-swift-incremental-RA-linux-ubuntu-14_04
Date of build: Wed, 31 Aug 2016 13:03:22 -0700
Build duration: 1 hr 12 min
Identified problems:

Timeout: This build was marked as FAIL because it timed out.
Indication 1 <https://ci.swift.org//job/oss-swift-incremental-RA-linux-ubuntu-14_04/7230/consoleFull#89513194756633f0f-8823-4f82-9a4a-0c0d97ce7760>
Tests:

Name: Swift(linux-x86_64)
Failed: 0 test(s), Passed: 8279 test(s), Total: 8279 test(s)
Name: Swift-Unit
Failed: 0 test(s), Passed: 230 test(s), Total: 230 test(s)

Changes

Commit 3fa09465c42941444c336acd68092362facd87a1 by nmaccharoli:
[stdlib] Move empty check for string concatenation to front

edit: stdlib/public/core/String.swift

Commit 82b37b3e7fed122150dd602e29cae966cebf494d by anders:
Check for loose source files in the `Tests` directory (it's a package

edit: Sources/PackageLoading/PackageBuilder.swift
edit: Tests/PackageLoadingTests/ConventionTests.swift

_______________________________________________
swift-dev mailing list
swift-dev@swift.org <mailto:swift-dev@swift.org>
https://lists.swift.org/mailman/listinfo/swift-dev

_______________________________________________
swift-dev mailing list
swift-dev@swift.org
https://lists.swift.org/mailman/listinfo/swift-dev