[Swift CI] Build Failure: 0. OSS - Swift Incremental RA - Ubuntu 14.04 - Long Test (master) #1469

Failure in the long test:

rm: cannot remove ‘/home/buildnode/jenkins/workspace/oss-swift-incremental-RA-linux-ubuntu-14_04-long-test/buildbot_incremental/foundation-linux-x86_64’: No such file or directory
/home/buildnode/jenkins/workspace/oss-swift-incremental-RA-linux-ubuntu-14_04-long-test/swift/utils/build-script: fatal error: command terminated with a non-zero exit status 1, aborting
/home/buildnode/jenkins/workspace/oss-swift-incremental-RA-linux-ubuntu-14_04-long-test/swift/utils/build-script: fatal error: command terminated with a non-zero exit status 1, aborting

Foundation didn’t get properly built?

···

On Nov 8, 2017, at 4:57 PM, no-reply@swift.org wrote:

[FAILURE] oss-swift-incremental-RA-linux-ubuntu-14_04-long-test [#1469]

Build URL: https://ci.swift.org/job/oss-swift-incremental-RA-linux-ubuntu-14_04-long-test/1469/
Project: oss-swift-incremental-RA-linux-ubuntu-14_04-long-test
Date of build: Wed, 08 Nov 2017 18:17:35 -0600
Build duration: 39 min

Changes

Commit a49455e3b23d8f91580b6282a146e4a800ae5265 by dgregor:
[Clang importer] Move the "all properties" lists into the name importer.

edit: lib/ClangImporter/ImportName.cpp
edit: lib/Sema/MiscDiagnostics.cpp
edit: include/swift/AST/ASTContext.h
edit: lib/AST/ASTContext.cpp
edit: lib/ClangImporter/ImportName.h

Commit bef1e6d0f1627c8720426e579f8752b5ca264a2a by github:
Force foundation and libdispatch to re-build always on non-darwin

edit: utils/build-script-impl

+Ross

Thanks,
Mishal Shah

···

On Nov 8, 2017, at 5:35 PM, Pavel Yaskevich <pyaskevich@apple.com> wrote:

Failure in the long test:

rm: cannot remove ‘/home/buildnode/jenkins/workspace/oss-swift-incremental-RA-linux-ubuntu-14_04-long-test/buildbot_incremental/foundation-linux-x86_64’: No such file or directory
/home/buildnode/jenkins/workspace/oss-swift-incremental-RA-linux-ubuntu-14_04-long-test/swift/utils/build-script: fatal error: command terminated with a non-zero exit status 1, aborting
/home/buildnode/jenkins/workspace/oss-swift-incremental-RA-linux-ubuntu-14_04-long-test/swift/utils/build-script: fatal error: command terminated with a non-zero exit status 1, aborting

Foundation didn’t get properly built?

On Nov 8, 2017, at 4:57 PM, no-reply@swift.org <mailto:no-reply@swift.org> wrote:

[FAILURE] oss-swift-incremental-RA-linux-ubuntu-14_04-long-test [#1469]

Build URL: https://ci.swift.org/job/oss-swift-incremental-RA-linux-ubuntu-14_04-long-test/1469/
Project: oss-swift-incremental-RA-linux-ubuntu-14_04-long-test
Date of build: Wed, 08 Nov 2017 18:17:35 -0600
Build duration: 39 min

Changes

Commit a49455e3b23d8f91580b6282a146e4a800ae5265 by dgregor:
[Clang importer] Move the "all properties" lists into the name importer.

edit: lib/ClangImporter/ImportName.cpp
edit: lib/Sema/MiscDiagnostics.cpp
edit: include/swift/AST/ASTContext.h
edit: lib/AST/ASTContext.cpp
edit: lib/ClangImporter/ImportName.h

Commit bef1e6d0f1627c8720426e579f8752b5ca264a2a by github:
Force foundation and libdispatch to re-build always on non-darwin

edit: utils/build-script-impl

Ah, looks like I forgot the `-f` option on the remove commands. I've made a quick patch here: https://github.com/apple/swift/pull/12831

Sincerely,
Ross Bayer
rbayer@apple.com

···

On Nov 8, 2017, at 5:35 PM, Pavel Yaskevich via swift-dev <swift-dev@swift.org> wrote:

https://ci.swift.org/job/oss-swift-incremental-RA-linux-ubuntu-14_04-long-test/1469/