[Swift CI] Build Still Failing: OSS - Swift Package - Ubuntu 15.10 (swift 3.0) #131


(Doug Coleman) #1

Filed a jira: https://bugs.swift.org/browse/SR-387

Ankit, is this one already fixed in master? I can’t find the bug report for the similar tempfile suffix naming bug.

Thanks,
Doug

Compiling Swift Module 'swift_build' (3 sources)
Link /home/wdillon/build/Ninja-ReleaseAssert/swiftpm-linux-armv7/.bootstrap/bin/swift-build
bootstrap: note: building self-hosted 'swift-build': env SWIFTC=/home/wdillon/build/Ninja-ReleaseAssert/swift-linux-armv7/bin/swiftc SWIFT_BUILD_TOOL=/home/wdillon/build/Ninja-ReleaseAssert/llbuild-linux-armv7/bin/swift-build-tool SWIFT_BUILD_PATH=/home/wdillon/build/Ninja-ReleaseAssert/swiftpm-linux-armv7 SWIFTPM_EMBED_RPATH=$ORIGIN/../lib/swift/linux /home/wdillon/build/Ninja-ReleaseAssert/swiftpm-linux-armv7/.bootstrap/bin/swift-build
LLVM ERROR: Program used external function '_TMaC18PackageDescription7Package' which could not be resolved!
error: ExitStatus(1, ["/home/wdillon/build/Ninja-ReleaseAssert/swift-linux-armv7/bin/swiftc", "--driver-mode=swift", "-I", "/home/wdillon/build/Ninja-ReleaseAssert/swiftpm-linux-armv7/.bootstrap/lib/swift/pm", "-L", "/home/wdillon/build/Ninja-ReleaseAssert/swiftpm-linux-armv7/.bootstrap/lib/swift/pm", "-lPackageDescription", "/home/wdillon/swiftpm/Package.swift"])
bootstrap: error: build failed with exit status 1
utils/build-script: command terminated with a non-zero exit status 1, aborting

···

On Oct 28, 2016, at 5:59 PM, no-reply@swift.org wrote:

New issue found!

[FAILURE] oss-swift-3.0-package-linux-ubuntu-15_10 [#131]

Build URL: https://ci.swift.org/job/oss-swift-3.0-package-linux-ubuntu-15_10/131/
Project: oss-swift-3.0-package-linux-ubuntu-15_10
Date of build: Fri, 28 Oct 2016 17:10:01 -0700
Build duration: 49 min
Identified problems:

Compile Error: This build failed because of a compile error. Below is a list of all errors in the build log:
Indication 1 <https://ci.swift.org//job/oss-swift-3.0-package-linux-ubuntu-15_10/131/consoleFull#-447557999ee1a197b-acac-4b17-83cf-a53b95139a76>
Changes

Commit 0e866a1c48bc66ba023591177973197bfb5871ac by kperry:
Ensure directory URL enumerator error handler block is invoked with

edit: stdlib/public/SDK/Foundation/FileManagerThunks.m
edit: apinotes/Foundation.apinotes
edit: test/1_stdlib/TestFileManager.swift
edit: stdlib/public/SDK/Foundation/FileManager.swift

Commit 017e11fce3eeaffd05df45a4461c1dcf5184badb by doug_coleman:
[build-script-impl]: Fixes version number on Linux from 3.0 to 3.0.x

edit: utils/build-script-impl

Commit 880f4644e212cb6bce09a1d57a95f7a7ca2e3269 by anders:
Bump version to 3.0.2.

edit: Sources/Utility/Versioning.swift


(Doug Coleman) #2

<unknown>:0: error: error parsing input file '/tmp/TemporaryFile.GtuKll' (expected top-level entity)
Can't parse Package.swift manifest file because it contains invalid format. Fix Package.swift file format and try again.
/home/buildnode/jenkins/workspace/oss-swift-3.0-package-linux-ubuntu-15_10/swiftpm/Tests/PackageLoadingTests/ManifestTests.swift:79: error: ManifestTests.testManifestLoading : failed - Unexpected error: invalidManifestFormat(nil)

More relevant...

···

On Oct 28, 2016, at 6:17 PM, Doug Coleman via swift-dev <swift-dev@swift.org> wrote:

Filed a jira: https://bugs.swift.org/browse/SR-387

Ankit, is this one already fixed in master? I can’t find the bug report for the similar tempfile suffix naming bug.

Thanks,
Doug

Compiling Swift Module 'swift_build' (3 sources)
Link /home/wdillon/build/Ninja-ReleaseAssert/swiftpm-linux-armv7/.bootstrap/bin/swift-build
bootstrap: note: building self-hosted 'swift-build': env SWIFTC=/home/wdillon/build/Ninja-ReleaseAssert/swift-linux-armv7/bin/swiftc SWIFT_BUILD_TOOL=/home/wdillon/build/Ninja-ReleaseAssert/llbuild-linux-armv7/bin/swift-build-tool SWIFT_BUILD_PATH=/home/wdillon/build/Ninja-ReleaseAssert/swiftpm-linux-armv7 SWIFTPM_EMBED_RPATH=$ORIGIN/../lib/swift/linux /home/wdillon/build/Ninja-ReleaseAssert/swiftpm-linux-armv7/.bootstrap/bin/swift-build
LLVM ERROR: Program used external function '_TMaC18PackageDescription7Package' which could not be resolved!
error: ExitStatus(1, ["/home/wdillon/build/Ninja-ReleaseAssert/swift-linux-armv7/bin/swiftc", "--driver-mode=swift", "-I", "/home/wdillon/build/Ninja-ReleaseAssert/swiftpm-linux-armv7/.bootstrap/lib/swift/pm", "-L", "/home/wdillon/build/Ninja-ReleaseAssert/swiftpm-linux-armv7/.bootstrap/lib/swift/pm", "-lPackageDescription", "/home/wdillon/swiftpm/Package.swift"])
bootstrap: error: build failed with exit status 1
utils/build-script: command terminated with a non-zero exit status 1, aborting

On Oct 28, 2016, at 5:59 PM, no-reply@swift.org <mailto:no-reply@swift.org> wrote:

New issue found!

[FAILURE] oss-swift-3.0-package-linux-ubuntu-15_10 [#131]

Build URL: https://ci.swift.org/job/oss-swift-3.0-package-linux-ubuntu-15_10/131/
Project: oss-swift-3.0-package-linux-ubuntu-15_10
Date of build: Fri, 28 Oct 2016 17:10:01 -0700
Build duration: 49 min
Identified problems:

Compile Error: This build failed because of a compile error. Below is a list of all errors in the build log:
Indication 1 <https://ci.swift.org//job/oss-swift-3.0-package-linux-ubuntu-15_10/131/consoleFull#-447557999ee1a197b-acac-4b17-83cf-a53b95139a76>
Changes

Commit 0e866a1c48bc66ba023591177973197bfb5871ac by kperry:
Ensure directory URL enumerator error handler block is invoked with

edit: stdlib/public/SDK/Foundation/FileManagerThunks.m
edit: apinotes/Foundation.apinotes
edit: test/1_stdlib/TestFileManager.swift
edit: stdlib/public/SDK/Foundation/FileManager.swift

Commit 017e11fce3eeaffd05df45a4461c1dcf5184badb by doug_coleman:
[build-script-impl]: Fixes version number on Linux from 3.0 to 3.0.x

edit: utils/build-script-impl

Commit 880f4644e212cb6bce09a1d57a95f7a7ca2e3269 by anders:
Bump version to 3.0.2.

edit: Sources/Utility/Versioning.swift

_______________________________________________
swift-dev mailing list
swift-dev@swift.org
https://lists.swift.org/mailman/listinfo/swift-dev


(Doug Coleman) #3

https://bugs.swift.org/browse/SR-3078

Man…I’m working with a really bad signal and messing up the urls. Sorry!

···

On Oct 28, 2016, at 6:20 PM, Doug Coleman <doug_coleman@apple.com> wrote:

<unknown>:0: error: error parsing input file '/tmp/TemporaryFile.GtuKll' (expected top-level entity)
Can't parse Package.swift manifest file because it contains invalid format. Fix Package.swift file format and try again.
/home/buildnode/jenkins/workspace/oss-swift-3.0-package-linux-ubuntu-15_10/swiftpm/Tests/PackageLoadingTests/ManifestTests.swift:79: error: ManifestTests.testManifestLoading : failed - Unexpected error: invalidManifestFormat(nil)

More relevant...

On Oct 28, 2016, at 6:17 PM, Doug Coleman via swift-dev <swift-dev@swift.org <mailto:swift-dev@swift.org>> wrote:

Filed a jira: https://bugs.swift.org/browse/SR-387

Ankit, is this one already fixed in master? I can’t find the bug report for the similar tempfile suffix naming bug.

Thanks,
Doug

Compiling Swift Module 'swift_build' (3 sources)
Link /home/wdillon/build/Ninja-ReleaseAssert/swiftpm-linux-armv7/.bootstrap/bin/swift-build
bootstrap: note: building self-hosted 'swift-build': env SWIFTC=/home/wdillon/build/Ninja-ReleaseAssert/swift-linux-armv7/bin/swiftc SWIFT_BUILD_TOOL=/home/wdillon/build/Ninja-ReleaseAssert/llbuild-linux-armv7/bin/swift-build-tool SWIFT_BUILD_PATH=/home/wdillon/build/Ninja-ReleaseAssert/swiftpm-linux-armv7 SWIFTPM_EMBED_RPATH=$ORIGIN/../lib/swift/linux /home/wdillon/build/Ninja-ReleaseAssert/swiftpm-linux-armv7/.bootstrap/bin/swift-build
LLVM ERROR: Program used external function '_TMaC18PackageDescription7Package' which could not be resolved!
error: ExitStatus(1, ["/home/wdillon/build/Ninja-ReleaseAssert/swift-linux-armv7/bin/swiftc", "--driver-mode=swift", "-I", "/home/wdillon/build/Ninja-ReleaseAssert/swiftpm-linux-armv7/.bootstrap/lib/swift/pm", "-L", "/home/wdillon/build/Ninja-ReleaseAssert/swiftpm-linux-armv7/.bootstrap/lib/swift/pm", "-lPackageDescription", "/home/wdillon/swiftpm/Package.swift"])
bootstrap: error: build failed with exit status 1
utils/build-script: command terminated with a non-zero exit status 1, aborting

On Oct 28, 2016, at 5:59 PM, no-reply@swift.org <mailto:no-reply@swift.org> wrote:

New issue found!

[FAILURE] oss-swift-3.0-package-linux-ubuntu-15_10 [#131]

Build URL: https://ci.swift.org/job/oss-swift-3.0-package-linux-ubuntu-15_10/131/
Project: oss-swift-3.0-package-linux-ubuntu-15_10
Date of build: Fri, 28 Oct 2016 17:10:01 -0700
Build duration: 49 min
Identified problems:

Compile Error: This build failed because of a compile error. Below is a list of all errors in the build log:
Indication 1 <https://ci.swift.org//job/oss-swift-3.0-package-linux-ubuntu-15_10/131/consoleFull#-447557999ee1a197b-acac-4b17-83cf-a53b95139a76>
Changes

Commit 0e866a1c48bc66ba023591177973197bfb5871ac by kperry:
Ensure directory URL enumerator error handler block is invoked with

edit: stdlib/public/SDK/Foundation/FileManagerThunks.m
edit: apinotes/Foundation.apinotes
edit: test/1_stdlib/TestFileManager.swift
edit: stdlib/public/SDK/Foundation/FileManager.swift

Commit 017e11fce3eeaffd05df45a4461c1dcf5184badb by doug_coleman:
[build-script-impl]: Fixes version number on Linux from 3.0 to 3.0.x

edit: utils/build-script-impl

Commit 880f4644e212cb6bce09a1d57a95f7a7ca2e3269 by anders:
Bump version to 3.0.2.

edit: Sources/Utility/Versioning.swift

_______________________________________________
swift-dev mailing list
swift-dev@swift.org <mailto:swift-dev@swift.org>
https://lists.swift.org/mailman/listinfo/swift-dev


(none) #4

Yes will cherry-pick the fix soon

···

On Saturday 29 October 2016, Doug Coleman via swift-dev <swift-dev@swift.org> wrote:

https://bugs.swift.org/browse/SR-3078

Man…I’m working with a really bad signal and messing up the urls. Sorry!

On Oct 28, 2016, at 6:20 PM, Doug Coleman <doug_coleman@apple.com > <javascript:_e(%7B%7D,'cvml','doug_coleman@apple.com');>> wrote:

<unknown>:0: error: error parsing input file '/tmp/TemporaryFile.GtuKll'
(expected top-level entity) Can't parse Package.swift manifest file
because it contains invalid format. Fix Package.swift file format and try
again. /home/buildnode/jenkins/workspace/oss-swift-3.0-
package-linux-ubuntu-15_10/swiftpm/Tests/PackageLoadingTests/ManifestTests.swift:79:
error: ManifestTests.testManifestLoading : failed - Unexpected error:
invalidManifestFormat(nil)

More relevant...

On Oct 28, 2016, at 6:17 PM, Doug Coleman via swift-dev < > swift-dev@swift.org <javascript:_e(%7B%7D,'cvml','swift-dev@swift.org');>> > wrote:

Filed a jira: https://bugs.swift.org/browse/SR-387

Ankit, is this one already fixed in master? I can’t find the bug report
for the similar tempfile suffix naming bug.

Thanks,
Doug

Compiling Swift Module 'swift_build' (3 sources)
Link /home/wdillon/build/Ninja-ReleaseAssert/swiftpm-linux-
armv7/.bootstrap/bin/swift-build
bootstrap: note: building self-hosted 'swift-build': env
SWIFTC=/home/wdillon/build/Ninja-ReleaseAssert/swift-linux-armv7/bin/swiftc
SWIFT_BUILD_TOOL=/home/wdillon/build/Ninja-ReleaseAssert/llbuild-linux-armv7/bin/swift-build-tool
SWIFT_BUILD_PATH=/home/wdillon/build/Ninja-ReleaseAssert/swiftpm-linux-armv7
SWIFTPM_EMBED_RPATH=$ORIGIN/../lib/swift/linux /home/wdillon/build/Ninja-
ReleaseAssert/swiftpm-linux-armv7/.bootstrap/bin/swift-build
LLVM ERROR: Program used external function '_
TMaC18PackageDescription7Package' which could not be resolved!
error: ExitStatus(1, ["/home/wdillon/build/Ninja-
ReleaseAssert/swift-linux-armv7/bin/swiftc", "--driver-mode=swift", "-I",
"/home/wdillon/build/Ninja-ReleaseAssert/swiftpm-linux-
armv7/.bootstrap/lib/swift/pm", "-L", "/home/wdillon/build/Ninja-
ReleaseAssert/swiftpm-linux-armv7/.bootstrap/lib/swift/pm",
"-lPackageDescription", "/home/wdillon/swiftpm/Package.swift"])
bootstrap: error: build failed with exit status 1
utils/build-script: command terminated with a non-zero exit status 1,
aborting

On Oct 28, 2016, at 5:59 PM, no-reply@swift.org > <javascript:_e(%7B%7D,'cvml','no-reply@swift.org');> wrote:

New issue found![FAILURE] oss-swift-3.0-package-linux-ubuntu-15_10 [#131]
Build URL: https://ci.swift.org/job/oss-swift-3.0-package-linux-
ubuntu-15_10/131/
Project: oss-swift-3.0-package-linux-ubuntu-15_10
Date of build: Fri, 28 Oct 2016 17:10:01 -0700
Build duration: 49 minIdentified problems:

   - Compile Error: This build failed because of a compile error. Below
   is a list of all errors in the build log:
      - Indication 1
      <https://ci.swift.org//job/oss-swift-3.0-package-linux-ubuntu-15_10/131/consoleFull#-447557999ee1a197b-acac-4b17-83cf-a53b95139a76>

Changes

   - Commit *0e866a1c48bc66ba023591177973197bfb5871ac* by *kperry:*

   Ensure directory URL enumerator error handler block is invoked with
   - *edit*: stdlib/public/SDK/Foundation/FileManagerThunks.m
      - *edit*: apinotes/Foundation.apinotes
      - *edit*: test/1_stdlib/TestFileManager.swift
      - *edit*: stdlib/public/SDK/Foundation/FileManager.swift

   - Commit *017e11fce3eeaffd05df45a4461c1dcf5184badb* by *doug_coleman:*

   [build-script-impl]: Fixes version number on Linux from 3.0 to 3.0.x
   - *edit*: utils/build-script-impl

   - Commit *880f4644e212cb6bce09a1d57a95f7a7ca2e3269* by *anders:*

   Bump version to 3.0.2.
   - *edit*: Sources/Utility/Versioning.swift

_______________________________________________
swift-dev mailing list
swift-dev@swift.org <javascript:_e(%7B%7D,'cvml','swift-dev@swift.org');>
https://lists.swift.org/mailman/listinfo/swift-dev

--
Ankit