[Swift CI] Build Still Failing: OSS - Swift Package - Ubuntu 15.10 (master) #1059


(Michael Ilseman) #1
···

Unexpected Passing Tests (1):
Swift :: 1_stdlib/ArrayTraps.swift.gyb

I don’t think my changes could affect this test.

On Apr 20, 2016, at 1:51 PM, no-reply@swift.org wrote:

New issue found!

[FAILURE] oss-swift-package-linux-ubuntu-15_10 [#1059]

Build URL:
https://ci.swift.org/job/oss-swift-package-linux-ubuntu-15_10/1059/
Project:
oss-swift-package-linux-ubuntu-15_10
Date of build:
Wed, 20 Apr 2016 13:37:30 -0700
Build duration:
14 min

Identified problems:

  • Unexpected pass: This build failed because a test marked as XFAIL unexpectedly passes. This could mean that the cause for the XFAIL is fixed, but it warrants investigation in any case.
  • Regression test failed: This build failed because a regression test in the test suite FAILed. Below is a list of all errors:

Changes

  • Commit 2e3662d1e7158f715d49428d1a2a2f23b03ca6fb by jordan_rose:
    [stdlib] Tweak callback for pthread_create to avoid signature issues.
  • edit: stdlib/private/SwiftPrivatePthreadExtras/SwiftPrivatePthreadExtras.swift

  • Commit 093009b3ef9329e44d8d4b8b69e271ba5e3b80d2 by rjmccall:
    Enhance the Remote / RemoteAST libraries with an error mechanism.

  • add: include/swift/Remote/Failure.h

  • add: include/swift/Remote/RemoteAddress.h

  • add: include/swift/Remote/FailureKinds.def

  • edit: include/swift/Remote/MemoryReader.h

  • edit: lib/RemoteAST/RemoteAST.cpp

  • edit: include/swift/RemoteAST/RemoteAST.h

  • Commit a8f9c8338bf7ba599b88a42e8c4e4df0f04ba1c0 by rjmccall:
    Adding missing #include for Linux.

  • edit: include/swift/Remote/Failure.h

  • Commit 74933f775d6d94f96748dbee14fb6452461e45b1 by milseman:
    [swift_newtype] Support for swift_wrapper/newtype attribute.

  • edit: include/clang/Basic/DiagnosticSemaKinds.td

  • edit: include/clang/Basic/AttrDocs.td

  • edit: include/clang/Basic/Attr.td

  • add: test/SemaObjC/attr-swift_newtype.c

  • edit: lib/Sema/SemaDeclAttr.cpp

  • edit: include/clang/Parse/Parser.h

  • edit: lib/Parse/ParseDecl.cpp

  • Commit fbe65cfab684a34b11208641bfdee9bbb9093b31 by milseman:
    [swift_name] add warning group, to enable flags

  • edit: include/clang/Basic/DiagnosticSemaKinds.td

(Greg Parker) #2

Nope, not your fault. This is a pre-existing problem. I'm not sure why the CI system thought that was a new issue.

···

On Apr 20, 2016, at 2:08 PM, Michael Ilseman <milseman@apple.com> wrote:

********************
Unexpected Passing Tests (1):
    Swift :: 1_stdlib/ArrayTraps.swift.gyb

I don’t think my changes could affect this test.

On Apr 20, 2016, at 1:51 PM, no-reply@swift.org <mailto:no-reply@swift.org> wrote:

New issue found!

[FAILURE] oss-swift-package-linux-ubuntu-15_10 [#1059]

Build URL: https://ci.swift.org/job/oss-swift-package-linux-ubuntu-15_10/1059/
Project: oss-swift-package-linux-ubuntu-15_10
Date of build: Wed, 20 Apr 2016 13:37:30 -0700
Build duration: 14 min
Identified problems:

Unexpected pass: This build failed because a test marked as XFAIL unexpectedly passes. This could mean that the cause for the XFAIL is fixed, but it warrants investigation in any case.
Indication 1 <https://ci.swift.org//job/oss-swift-package-linux-ubuntu-15_10/1059/consoleFull#801347659b011c97a-0462-424c-ac47-5640e6148d79>
Regression test failed: This build failed because a regression test in the test suite FAILed. Below is a list of all errors:
Indication 1 <https://ci.swift.org//job/oss-swift-package-linux-ubuntu-15_10/1059/consoleFull#529225681fca400bf-2f4a-462e-b517-e058d770b2d7>
Changes

Commit 2e3662d1e7158f715d49428d1a2a2f23b03ca6fb by jordan_rose:
[stdlib] Tweak callback for pthread_create to avoid signature issues.

edit: stdlib/private/SwiftPrivatePthreadExtras/SwiftPrivatePthreadExtras.swift

Commit 093009b3ef9329e44d8d4b8b69e271ba5e3b80d2 by rjmccall:
Enhance the Remote / RemoteAST libraries with an error mechanism.

add: include/swift/Remote/Failure.h
add: include/swift/Remote/RemoteAddress.h
add: include/swift/Remote/FailureKinds.def
edit: include/swift/Remote/MemoryReader.h
edit: lib/RemoteAST/RemoteAST.cpp
edit: include/swift/RemoteAST/RemoteAST.h

Commit a8f9c8338bf7ba599b88a42e8c4e4df0f04ba1c0 by rjmccall:
Adding missing #include for Linux.

edit: include/swift/Remote/Failure.h

Commit 74933f775d6d94f96748dbee14fb6452461e45b1 by milseman:
[swift_newtype] Support for swift_wrapper/newtype attribute.

edit: include/clang/Basic/DiagnosticSemaKinds.td
edit: include/clang/Basic/AttrDocs.td
edit: include/clang/Basic/Attr.td
add: test/SemaObjC/attr-swift_newtype.c
edit: lib/Sema/SemaDeclAttr.cpp
edit: include/clang/Parse/Parser.h
edit: lib/Parse/ParseDecl.cpp

Commit fbe65cfab684a34b11208641bfdee9bbb9093b31 by milseman:
[swift_name] add warning group, to enable flags

edit: include/clang/Basic/DiagnosticSemaKinds.td


(Erik Eckstein) #3

Xin and I working on a fix for the original problem.
I think we should _disable_ this test on linux in the meantime and not _xfail_ it.

Erik

···

On Apr 20, 2016, at 2:10 PM, Greg Parker via swift-dev <swift-dev@swift.org> wrote:

Nope, not your fault. This is a pre-existing problem. I'm not sure why the CI system thought that was a new issue.

On Apr 20, 2016, at 2:08 PM, Michael Ilseman <milseman@apple.com <mailto:milseman@apple.com>> wrote:

********************
Unexpected Passing Tests (1):
    Swift :: 1_stdlib/ArrayTraps.swift.gyb

I don’t think my changes could affect this test.

On Apr 20, 2016, at 1:51 PM, no-reply@swift.org <mailto:no-reply@swift.org> wrote:

New issue found!

[FAILURE] oss-swift-package-linux-ubuntu-15_10 [#1059]

Build URL: https://ci.swift.org/job/oss-swift-package-linux-ubuntu-15_10/1059/
Project: oss-swift-package-linux-ubuntu-15_10
Date of build: Wed, 20 Apr 2016 13:37:30 -0700
Build duration: 14 min
Identified problems:

Unexpected pass: This build failed because a test marked as XFAIL unexpectedly passes. This could mean that the cause for the XFAIL is fixed, but it warrants investigation in any case.
Indication 1 <https://ci.swift.org//job/oss-swift-package-linux-ubuntu-15_10/1059/consoleFull#801347659b011c97a-0462-424c-ac47-5640e6148d79>
Regression test failed: This build failed because a regression test in the test suite FAILed. Below is a list of all errors:
Indication 1 <https://ci.swift.org//job/oss-swift-package-linux-ubuntu-15_10/1059/consoleFull#529225681fca400bf-2f4a-462e-b517-e058d770b2d7>
Changes

Commit 2e3662d1e7158f715d49428d1a2a2f23b03ca6fb by jordan_rose:
[stdlib] Tweak callback for pthread_create to avoid signature issues.

edit: stdlib/private/SwiftPrivatePthreadExtras/SwiftPrivatePthreadExtras.swift

Commit 093009b3ef9329e44d8d4b8b69e271ba5e3b80d2 by rjmccall:
Enhance the Remote / RemoteAST libraries with an error mechanism.

add: include/swift/Remote/Failure.h
add: include/swift/Remote/RemoteAddress.h
add: include/swift/Remote/FailureKinds.def
edit: include/swift/Remote/MemoryReader.h
edit: lib/RemoteAST/RemoteAST.cpp
edit: include/swift/RemoteAST/RemoteAST.h

Commit a8f9c8338bf7ba599b88a42e8c4e4df0f04ba1c0 by rjmccall:
Adding missing #include for Linux.

edit: include/swift/Remote/Failure.h

Commit 74933f775d6d94f96748dbee14fb6452461e45b1 by milseman:
[swift_newtype] Support for swift_wrapper/newtype attribute.

edit: include/clang/Basic/DiagnosticSemaKinds.td
edit: include/clang/Basic/AttrDocs.td
edit: include/clang/Basic/Attr.td
add: test/SemaObjC/attr-swift_newtype.c
edit: lib/Sema/SemaDeclAttr.cpp
edit: include/clang/Parse/Parser.h
edit: lib/Parse/ParseDecl.cpp

Commit fbe65cfab684a34b11208641bfdee9bbb9093b31 by milseman:
[swift_name] add warning group, to enable flags

edit: include/clang/Basic/DiagnosticSemaKinds.td

_______________________________________________
swift-dev mailing list
swift-dev@swift.org
https://lists.swift.org/mailman/listinfo/swift-dev


(Erik Eckstein) #4

BTW, this is the radar: rdar://problem/25842757 <rdar://problem/25842757>

···

On Apr 20, 2016, at 5:03 PM, Erik Eckstein via swift-dev <swift-dev@swift.org> wrote:

Xin and I working on a fix for the original problem.
I think we should _disable_ this test on linux in the meantime and not _xfail_ it.

Erik

On Apr 20, 2016, at 2:10 PM, Greg Parker via swift-dev <swift-dev@swift.org <mailto:swift-dev@swift.org>> wrote:

Nope, not your fault. This is a pre-existing problem. I'm not sure why the CI system thought that was a new issue.

On Apr 20, 2016, at 2:08 PM, Michael Ilseman <milseman@apple.com <mailto:milseman@apple.com>> wrote:

********************
Unexpected Passing Tests (1):
    Swift :: 1_stdlib/ArrayTraps.swift.gyb

I don’t think my changes could affect this test.

On Apr 20, 2016, at 1:51 PM, no-reply@swift.org <mailto:no-reply@swift.org> wrote:

New issue found!

[FAILURE] oss-swift-package-linux-ubuntu-15_10 [#1059]

Build URL: https://ci.swift.org/job/oss-swift-package-linux-ubuntu-15_10/1059/
Project: oss-swift-package-linux-ubuntu-15_10
Date of build: Wed, 20 Apr 2016 13:37:30 -0700
Build duration: 14 min
Identified problems:

Unexpected pass: This build failed because a test marked as XFAIL unexpectedly passes. This could mean that the cause for the XFAIL is fixed, but it warrants investigation in any case.
Indication 1 <https://ci.swift.org//job/oss-swift-package-linux-ubuntu-15_10/1059/consoleFull#801347659b011c97a-0462-424c-ac47-5640e6148d79>
Regression test failed: This build failed because a regression test in the test suite FAILed. Below is a list of all errors:
Indication 1 <https://ci.swift.org//job/oss-swift-package-linux-ubuntu-15_10/1059/consoleFull#529225681fca400bf-2f4a-462e-b517-e058d770b2d7>
Changes

Commit 2e3662d1e7158f715d49428d1a2a2f23b03ca6fb by jordan_rose:
[stdlib] Tweak callback for pthread_create to avoid signature issues.

edit: stdlib/private/SwiftPrivatePthreadExtras/SwiftPrivatePthreadExtras.swift

Commit 093009b3ef9329e44d8d4b8b69e271ba5e3b80d2 by rjmccall:
Enhance the Remote / RemoteAST libraries with an error mechanism.

add: include/swift/Remote/Failure.h
add: include/swift/Remote/RemoteAddress.h
add: include/swift/Remote/FailureKinds.def
edit: include/swift/Remote/MemoryReader.h
edit: lib/RemoteAST/RemoteAST.cpp
edit: include/swift/RemoteAST/RemoteAST.h

Commit a8f9c8338bf7ba599b88a42e8c4e4df0f04ba1c0 by rjmccall:
Adding missing #include for Linux.

edit: include/swift/Remote/Failure.h

Commit 74933f775d6d94f96748dbee14fb6452461e45b1 by milseman:
[swift_newtype] Support for swift_wrapper/newtype attribute.

edit: include/clang/Basic/DiagnosticSemaKinds.td
edit: include/clang/Basic/AttrDocs.td
edit: include/clang/Basic/Attr.td
add: test/SemaObjC/attr-swift_newtype.c
edit: lib/Sema/SemaDeclAttr.cpp
edit: include/clang/Parse/Parser.h
edit: lib/Parse/ParseDecl.cpp

Commit fbe65cfab684a34b11208641bfdee9bbb9093b31 by milseman:
[swift_name] add warning group, to enable flags

edit: include/clang/Basic/DiagnosticSemaKinds.td

_______________________________________________
swift-dev mailing list
swift-dev@swift.org <mailto:swift-dev@swift.org>
https://lists.swift.org/mailman/listinfo/swift-dev

_______________________________________________
swift-dev mailing list
swift-dev@swift.org
https://lists.swift.org/mailman/listinfo/swift-dev


(Greg Parker) #5

I changed the test to `UNSUPPORTED: linux` earlier this afternoon so the bots should be pacified eventually.

···

On Apr 20, 2016, at 5:03 PM, Erik Eckstein <eeckstein@apple.com> wrote:

BTW, this is the radar: rdar://problem/25842757 <rdar://problem/25842757>

On Apr 20, 2016, at 5:03 PM, Erik Eckstein via swift-dev <swift-dev@swift.org <mailto:swift-dev@swift.org>> wrote:

Xin and I working on a fix for the original problem.
I think we should _disable_ this test on linux in the meantime and not _xfail_ it.

Erik

On Apr 20, 2016, at 2:10 PM, Greg Parker via swift-dev <swift-dev@swift.org <mailto:swift-dev@swift.org>> wrote:

Nope, not your fault. This is a pre-existing problem. I'm not sure why the CI system thought that was a new issue.

On Apr 20, 2016, at 2:08 PM, Michael Ilseman <milseman@apple.com <mailto:milseman@apple.com>> wrote:

********************
Unexpected Passing Tests (1):
    Swift :: 1_stdlib/ArrayTraps.swift.gyb

I don’t think my changes could affect this test.

On Apr 20, 2016, at 1:51 PM, no-reply@swift.org <mailto:no-reply@swift.org> wrote:

New issue found!

[FAILURE] oss-swift-package-linux-ubuntu-15_10 [#1059]

Build URL: https://ci.swift.org/job/oss-swift-package-linux-ubuntu-15_10/1059/
Project: oss-swift-package-linux-ubuntu-15_10
Date of build: Wed, 20 Apr 2016 13:37:30 -0700
Build duration: 14 min
Identified problems:

Unexpected pass: This build failed because a test marked as XFAIL unexpectedly passes. This could mean that the cause for the XFAIL is fixed, but it warrants investigation in any case.
Indication 1 <https://ci.swift.org//job/oss-swift-package-linux-ubuntu-15_10/1059/consoleFull#801347659b011c97a-0462-424c-ac47-5640e6148d79>
Regression test failed: This build failed because a regression test in the test suite FAILed. Below is a list of all errors:
Indication 1 <https://ci.swift.org//job/oss-swift-package-linux-ubuntu-15_10/1059/consoleFull#529225681fca400bf-2f4a-462e-b517-e058d770b2d7>
Changes

Commit 2e3662d1e7158f715d49428d1a2a2f23b03ca6fb by jordan_rose:
[stdlib] Tweak callback for pthread_create to avoid signature issues.

edit: stdlib/private/SwiftPrivatePthreadExtras/SwiftPrivatePthreadExtras.swift

Commit 093009b3ef9329e44d8d4b8b69e271ba5e3b80d2 by rjmccall:
Enhance the Remote / RemoteAST libraries with an error mechanism.

add: include/swift/Remote/Failure.h
add: include/swift/Remote/RemoteAddress.h
add: include/swift/Remote/FailureKinds.def
edit: include/swift/Remote/MemoryReader.h
edit: lib/RemoteAST/RemoteAST.cpp
edit: include/swift/RemoteAST/RemoteAST.h

Commit a8f9c8338bf7ba599b88a42e8c4e4df0f04ba1c0 by rjmccall:
Adding missing #include for Linux.

edit: include/swift/Remote/Failure.h

Commit 74933f775d6d94f96748dbee14fb6452461e45b1 by milseman:
[swift_newtype] Support for swift_wrapper/newtype attribute.

edit: include/clang/Basic/DiagnosticSemaKinds.td
edit: include/clang/Basic/AttrDocs.td
edit: include/clang/Basic/Attr.td
add: test/SemaObjC/attr-swift_newtype.c
edit: lib/Sema/SemaDeclAttr.cpp
edit: include/clang/Parse/Parser.h
edit: lib/Parse/ParseDecl.cpp

Commit fbe65cfab684a34b11208641bfdee9bbb9093b31 by milseman:
[swift_name] add warning group, to enable flags

edit: include/clang/Basic/DiagnosticSemaKinds.td

_______________________________________________
swift-dev mailing list
swift-dev@swift.org <mailto:swift-dev@swift.org>
https://lists.swift.org/mailman/listinfo/swift-dev

_______________________________________________
swift-dev mailing list
swift-dev@swift.org <mailto:swift-dev@swift.org>
https://lists.swift.org/mailman/listinfo/swift-dev