[Swift CI] Build Still Failing: OSS - Swift Package - Ubuntu 14.04 (master) #1892


(Daniel Dunbar) #1

Anyone know who/what is tracking this:

-- Testing: 19 tests, 12 threads --
FAIL: SwiftXCTestFunctionalTests :: Asynchronous/Predicates/Expectations/main.swift (10 of 19)
<>******************** TEST 'SwiftXCTestFunctionalTests :: Asynchronous/Predicates/Expectations/main.swift' FAILED ********************
Script:

···

--
/home/buildnode/disk2/workspace/oss-swift-package-linux-ubuntu-14_04/build/buildbot_linux/swift-linux-x86_64/bin/swiftc -Xlinker -rpath -Xlinker /home/buildnode/disk2/workspace/oss-swift-package-linux-ubuntu-14_04/build/buildbot_linux/xctest-linux-x86_64 -L /home/buildnode/disk2/workspace/oss-swift-package-linux-ubuntu-14_04/build/buildbot_linux/xctest-linux-x86_64 -I /home/buildnode/disk2/workspace/oss-swift-package-linux-ubuntu-14_04/build/buildbot_linux/xctest-linux-x86_64 -Xlinker -rpath -Xlinker /home/buildnode/disk2/workspace/oss-swift-package-linux-ubuntu-14_04/build/buildbot_linux/foundation-linux-x86_64/Foundation -L /home/buildnode/disk2/workspace/oss-swift-package-linux-ubuntu-14_04/build/buildbot_linux/foundation-linux-x86_64/Foundation -I /home/buildnode/disk2/workspace/oss-swift-package-linux-ubuntu-14_04/build/buildbot_linux/foundation-linux-x86_64/Foundation -I /home/buildnode/disk2/workspace/oss-swift-package-linux-ubuntu-14_04/build/buildbot_linux/foundation-linux-x86_64/Foundation/usr/lib/swift /home/buildnode/disk2/workspace/oss-swift-package-linux-ubuntu-14_04/swift-corelibs-xctest/Tests/Functional/Asynchronous/Predicates/Expectations/main.swift -o /home/buildnode/disk2/workspace/oss-swift-package-linux-ubuntu-14_04/swift-corelibs-xctest/Tests/Functional/Asynchronous/Predicates/Expectations/Output/Asynchronous-Predicates
/home/buildnode/disk2/workspace/oss-swift-package-linux-ubuntu-14_04/swift-corelibs-xctest/Tests/Functional/Asynchronous/Predicates/Expectations/Output/Asynchronous-Predicates > /home/buildnode/disk2/workspace/oss-swift-package-linux-ubuntu-14_04/swift-corelibs-xctest/Tests/Functional/Asynchronous/Predicates/Expectations/Output/main.swift.tmp || true
/home/buildnode/disk2/workspace/oss-swift-package-linux-ubuntu-14_04/swift-corelibs-xctest/Tests/Functional/xctest_checker/xctest_checker.py /home/buildnode/disk2/workspace/oss-swift-package-linux-ubuntu-14_04/swift-corelibs-xctest/Tests/Functional/Asynchronous/Predicates/Expectations/Output/main.swift.tmp /home/buildnode/disk2/workspace/oss-swift-package-linux-ubuntu-14_04/swift-corelibs-xctest/Tests/Functional/Asynchronous/Predicates/Expectations/main.swift
--
Exit Code: 1

Command Output (stdout):
--
Command 0: "/home/buildnode/disk2/workspace/oss-swift-package-linux-ubuntu-14_04/build/buildbot_linux/swift-linux-x86_64/bin/swiftc" "-Xlinker" "-rpath" "-Xlinker" "/home/buildnode/disk2/workspace/oss-swift-package-linux-ubuntu-14_04/build/buildbot_linux/xctest-linux-x86_64" "-L" "/home/buildnode/disk2/workspace/oss-swift-package-linux-ubuntu-14_04/build/buildbot_linux/xctest-linux-x86_64" "-I" "/home/buildnode/disk2/workspace/oss-swift-package-linux-ubuntu-14_04/build/buildbot_linux/xctest-linux-x86_64" "-Xlinker" "-rpath" "-Xlinker" "/home/buildnode/disk2/workspace/oss-swift-package-linux-ubuntu-14_04/build/buildbot_linux/foundation-linux-x86_64/Foundation" "-L" "/home/buildnode/disk2/workspace/oss-swift-package-linux-ubuntu-14_04/build/buildbot_linux/foundation-linux-x86_64/Foundation" "-I" "/home/buildnode/disk2/workspace/oss-swift-package-linux-ubuntu-14_04/build/buildbot_linux/foundation-linux-x86_64/Foundation" "-I" "/home/buildnode/disk2/workspace/oss-swift-package-linux-ubuntu-14_04/build/buildbot_linux/foundation-linux-x86_64/Foundation/usr/lib/swift" "/home/buildnode/disk2/workspace/oss-swift-package-linux-ubuntu-14_04/swift-corelibs-xctest/Tests/Functional/Asynchronous/Predicates/Expectations/main.swift" "-o" "/home/buildnode/disk2/workspace/oss-swift-package-linux-ubuntu-14_04/swift-corelibs-xctest/Tests/Functional/Asynchronous/Predicates/Expectations/Output/Asynchronous-Predicates"
Command 0 Result: 0
Command 0 Output:

Command 0 Stderr:
/home/buildnode/disk2/workspace/oss-swift-package-linux-ubuntu-14_04/swift-corelibs-xctest/Tests/Functional/Asynchronous/Predicates/Expectations/main.swift:23:9: warning: result of call to 'expectation(for:evaluatedWith:file:line:handler:)' is unused
        expectation(for: predicate, evaluatedWith: object)
        ^ ~~~~~~~~~~~~~~~~~~~~~~~~~~~~~~~~~~~~~~~
/home/buildnode/disk2/workspace/oss-swift-package-linux-ubuntu-14_04/swift-corelibs-xctest/Tests/Functional/Asynchronous/Predicates/Expectations/main.swift:33:9: warning: result of call to 'expectation(for:evaluatedWith:file:line:handler:)' is unused
        expectation(for: predicate, evaluatedWith: object)
        ^ ~~~~~~~~~~~~~~~~~~~~~~~~~~~~~~~~~~~~~~~
/home/buildnode/disk2/workspace/oss-swift-package-linux-ubuntu-14_04/swift-corelibs-xctest/Tests/Functional/Asynchronous/Predicates/Expectations/main.swift:48:9: warning: result of call to 'expectation(for:evaluatedWith:file:line:handler:)' is unused
        expectation(for: predicate, evaluatedWith: halfSecLaterDate)
        ^ ~~~~~~~~~~~~~~~~~~~~~~~~~~~~~~~~~~~~~~~~~~~~~~~~~
/home/buildnode/disk2/workspace/oss-swift-package-linux-ubuntu-14_04/swift-corelibs-xctest/Tests/Functional/Asynchronous/Predicates/Expectations/main.swift:62:9: warning: result of call to 'expectation(for:evaluatedWith:file:line:handler:)' is unused
        expectation(for: predicate, evaluatedWith: halfSecLaterDate)
        ^ ~~~~~~~~~~~~~~~~~~~~~~~~~~~~~~~~~~~~~~~~~~~~~~~~~

Command 1: "/home/buildnode/disk2/workspace/oss-swift-package-linux-ubuntu-14_04/swift-corelibs-xctest/Tests/Functional/Asynchronous/Predicates/Expectations/Output/Asynchronous-Predicates"
Command 1 Result: -7
Command 1 Output:
None

Command 1 Stderr:

Command 2: "true"
Command 2 Result: 0
Command 2 Output:

Command 2 Stderr:

Command 3: "/home/buildnode/disk2/workspace/oss-swift-package-linux-ubuntu-14_04/swift-corelibs-xctest/Tests/Functional/xctest_checker/xctest_checker.py" "/home/buildnode/disk2/workspace/oss-swift-package-linux-ubuntu-14_04/swift-corelibs-xctest/Tests/Functional/Asynchronous/Predicates/Expectations/Output/main.swift.tmp" "/home/buildnode/disk2/workspace/oss-swift-package-linux-ubuntu-14_04/swift-corelibs-xctest/Tests/Functional/Asynchronous/Predicates/Expectations/main.swift"
Command 3 Result: 1
Command 3 Output:

Command 3 Stderr:
Traceback (most recent call last):
  File "/home/buildnode/disk2/workspace/oss-swift-package-linux-ubuntu-14_04/swift-corelibs-xctest/Tests/Functional/xctest_checker/xctest_checker.py", line 15, in <module>
    xctest_checker.main.main()
  File "/home/buildnode/disk2/workspace/oss-swift-package-linux-ubuntu-14_04/swift-corelibs-xctest/Tests/Functional/xctest_checker/xctest_checker/main.py", line 61, in main
    compare.compare(args.actual, args.expected, args.check_prefix)
  File "/home/buildnode/disk2/workspace/oss-swift-package-linux-ubuntu-14_04/swift-corelibs-xctest/Tests/Functional/xctest_checker/xctest_checker/compare.py", line 85, in compare
    repr(expected_line)))
xctest_checker.error.XCTestCheckerError:
/home/buildnode/disk2/workspace/oss-swift-package-linux-ubuntu-14_04/swift-corelibs-xctest/Tests/Functional/Asynchronous/Predicates/Expectations/main.swift:53: There were more lines expected to appear than there were lines in the actual input. Unmet expectation: "Test Case 'PredicateExpectationsTestCase.test_immediatelyTrueDelayedFalsePredicateAndObject_passes' passed \\(\\d+\\.\\d+ seconds\\)."

--

********************

Testing Time: 2.03s
********************
Failing Tests (1):
    SwiftXCTestFunctionalTests :: Asynchronous/Predicates/Expectations/main.swift

  Expected Passes : 18
  Unexpected Failures: 1
xctest-build: SWIFT_EXEC=/home/buildnode/disk2/workspace/oss-swift-package-linux-ubuntu-14_04/build/buildbot_linux/swift-linux-x86_64/bin/swiftc BUILT_PRODUCTS_DIR=/home/buildnode/disk2/workspace/oss-swift-package-linux-ubuntu-14_04/build/buildbot_linux/xctest-linux-x86_64 FOUNDATION_BUILT_PRODUCTS_DIR=/home/buildnode/disk2/workspace/oss-swift-package-linux-ubuntu-14_04/build/buildbot_linux/foundation-linux-x86_64/Foundation CORE_FOUNDATION_BUILT_PRODUCTS_DIR=/home/buildnode/disk2/workspace/oss-swift-package-linux-ubuntu-14_04/build/buildbot_linux/foundation-linux-x86_64/Foundation/usr/lib/swift /home/buildnode/disk2/workspace/oss-swift-package-linux-ubuntu-14_04/llvm/utils/lit/lit.py -sv --no-progress-bar /home/buildnode/disk2/workspace/oss-swift-package-linux-ubuntu-14_04/swift-corelibs-xctest/Tests/Functional

  - Daniel

On Aug 11, 2016, at 7:29 PM, no-reply@swift.org wrote:

New issue found!

[FAILURE] oss-swift-package-linux-ubuntu-14_04 [#1892]

Build URL: https://ci.swift.org/job/oss-swift-package-linux-ubuntu-14_04/1892/
Project: oss-swift-package-linux-ubuntu-14_04
Date of build: Thu, 11 Aug 2016 18:35:48 -0700
Build duration: 53 min
Identified problems:

Regression test failed: This build failed because a regression test in the test suite FAILed. Below is a list of all errors:
Indication 1 <https://ci.swift.org//job/oss-swift-package-linux-ubuntu-14_04/1892/consoleFull#-936285465fca400bf-2f4a-462e-b517-e058d770b2d7>
Changes

Commit 54bc52eb1b5c99c127ed132548c3d28e605e0141 by jgroff:
Sema: Assigning vars of generic param type should not use runtime

edit: lib/Sema/TypeCheckCaptures.cpp
edit: test/ClangModules/objc_bridging_generics.swift

Commit a56d6ac0685bdcba6994331d56ad3c33582b7c54 by mgottesman:
[build-script] Move llvm-targets-to-build to

edit: utils/build-script-impl
add: utils/swift_build_support/tests/products/test_llvm.py
edit: utils/build-presets.ini
edit: utils/build-script
edit: utils/swift_build_support/swift_build_support/products/llvm.py

Commit 14b2dd52967b6cfb2957ec907fc04ad2b82abf0d by mgottesman:
[build-script] Move computation of LLVM_ENABLE_ASSERTIONS from

edit: utils/build-script
edit: utils/build-script-impl
edit: utils/swift_build_support/swift_build_support/products/llvm.py
edit: utils/swift_build_support/tests/products/test_llvm.py

Commit 454ee8a8d9314b33487cb3a5ffd769c6753cc77b by blangmuir:
[fixcode] Add ( as AnyObject) fixit to the whitelist

edit: test/FixCode/fixits-apply.swift.result
edit: test/FixCode/fixits-apply.swift
edit: lib/FrontendTool/FrontendTool.cpp

Commit 390c1a45fb9b91276f3c995ecbf6f2ff7742012a by aschwaighofer:
Fix IRGen for associated type witness accessor functions in generic

edit: lib/IRGen/GenProto.cpp
edit: test/IRGen/same_type_constraints.swift

Commit ec539d6abf8aabb747198f41c68cbcde32c28c47 by blangmuir:
[fixcode] Enabled protocol<...> fixits

edit: test/FixCode/fixits-apply.swift.result
edit: lib/FrontendTool/FrontendTool.cpp
edit: test/FixCode/fixits-apply.swift

Commit b5864f87f3ff436d8b332067f91a8a441b3a5fed by harlan:
[coverage] Add cov2json tool for serializing code coverage

edit: tools/CMakeLists.txt
add: tools/cov2json/JSONWriter.h
add: tools/cov2json/CMakeLists.txt
add: tools/cov2json/ProfileData.h
add: tools/cov2json/ProfileData.cpp
add: tools/cov2json/main.cpp

Commit 1cc7700d202c25d430aead49696c9b6ec8bb70ef by xin_tong:
Change SE-128 to SE-0128 and a grammar fix.

edit: CHANGELOG.md

Commit d25b6a5c2834dfcad56e745fb6ff22c1eac2b66d by jgroff:
Sema/SILGen: Do erasure from pseudogeneric T to Any without requiring

edit: lib/Sema/TypeCheckCaptures.cpp
edit: test/ClangModules/objc_bridging_generics.swift
edit: lib/SILGen/SILGenConvert.cpp
edit: test/SILGen/objc_bridging_any.swift

Commit f3a5d3a3360efa93b89914c8a462202c6c390724 by jgroff:
Sema: Dynamic casts to ObjC generic classes don't use the type metadata

edit: test/ClangModules/objc_bridging_generics.swift
edit: lib/Sema/TypeCheckCaptures.cpp

Commit 69918a966d2c0b34d83669ffc8809182f587dca0 by kyrtzidis:
[ASTPrinter] Fix printing of nested typealias types and make it

edit: test/decl/protocol/protocols.swift
edit: test/FixCode/fixits-apply.swift
edit: test/IDE/complete_from_foundation_overlay.swift
edit: test/stmt/foreach.swift
edit: include/swift/AST/PrintOptions.h
edit: test/Constraints/same_types.swift
edit: test/IDE/complete_from_stdlib.swift
edit: test/Constraints/diagnostics.swift
edit: lib/AST/ASTPrinter.cpp
edit: test/SourceKit/InterfaceGen/gen_stdlib.swift
edit: test/IDE/complete_associated_types.swift
edit: test/IDE/print_synthesized_extensions.swift
edit: test/TypeCoercion/integer_literals.swift
edit: test/decl/protocol/req/func.swift
edit: test/decl/protocol/conforms/associated_type.swift
edit: test/IDE/complete_crashes.swift
edit: test/ClangModules/enum-with-target.swift
edit: test/attr/attr_specialize.swift
edit: test/Generics/superclass_constraint.swift
edit: test/FixCode/fixits-apply.swift.result
edit: test/Generics/generic_types.swift
edit: test/IDE/print_ast_tc_decls.swift
edit: test/decl/ext/protocol.swift
edit: test/multifile/Inputs/external-protocol-conformance/A.swift
edit: test/IDE/complete_literal.swift

Commit 126602d7dd30d263a753a94574f5f4e6cbf88bfa by kyrtzidis:
[test] Update 'validation-test/stdlib/CollectionDiagnostics.swift'

edit: validation-test/stdlib/CollectionDiagnostics.swift

Commit aa3d2e65f32dea640f8eb8b30daf843e44061a54 by kyrtzidis:
[ASTPrinter] Simplify code using 'getDeclaredType()', as suggested by

edit: lib/AST/ASTPrinter.cpp

Commit f65ad810df9280c55649a4257ad4375d96645151 by github:
Check protocol witnesses using access scopes. (#4176)

edit: test/Sema/accessibility.swift
edit: lib/Sema/TypeCheckDecl.cpp
edit: lib/Sema/MiscDiagnostics.cpp
edit: lib/Sema/TypeCheckProtocol.cpp
edit: lib/Sema/MiscDiagnostics.h
edit: test/NameBinding/accessibility.swift

Commit 753642e0050d9de45a171f8751e757916895d29a by mark.lacey:
Special-case error for indexing into a nil literal.

edit: lib/Sema/CSDiag.cpp
edit: test/decl/subscript/subscripting.swift
edit: include/swift/AST/DiagnosticsSema.def

Commit 148e25dc03f8f6ceabd15603e19e0adf09dcc4e9 by github:
Provide the '@escaping' fix-it for any call-site escaping mismatch.

edit: test/attr/attr_escaping.swift
edit: lib/Sema/CSDiag.cpp

Commit 133c63c44b95614180bcd16a7bdea6cba1638d69 by github:
[Parse] Fix fix-it for old-style 'where' clauses. (#4198)

edit: test/Parse/deprecated_where.swift
edit: lib/Parse/ParseGeneric.cpp

Commit 42527ed18b275e4fe7f4dea0ede604319a20008a by jgroff:
IRGen: Don't attempt to emit debug info for type-erased generic params.

edit: lib/IRGen/GenMeta.h
edit: lib/IRGen/IRGenSIL.cpp
edit: lib/IRGen/GenMeta.cpp
add: test/IRGen/objc_generic_class_debug_info.swift

Commit a4a9d19b3fe3fbddcd225baa31157689e4cdb009 by jgroff:
Sema: Diagnose init calls as uses of generic params.

edit: test/ClangModules/objc_bridging_generics.swift
edit: lib/Sema/TypeCheckCaptures.cpp

Commit 294bbd8e17c5893514599e52d02a37ce4e9ae24d by github:
[Parse] Attach 'inout' to Swift 2 unparenthesized function params.

edit: test/type/types.swift
edit: lib/Parse/ParsePattern.cpp

Commit 0bb0c9ea41f26f6d940bb0fc6e66d90a28b21d92 by daniel_dunbar:
[TestSupport] Add convenience initializers for testing FS instances.

edit: Tests/PackageLoadingTests/ConventionTests.swift
add: Sources/TestSupport/FileSystemExtensions.swift
edit: Tests/PackageLoadingTests/ModuleMapGenerationTests.swift

Commit 66408be65736ad2dfc314a57a00ed5b91b0b1a99 by daniel_dunbar:
[TestSupport] Add missing target dependency.

edit: Package.swift

Commit 5013cd7028e87e41145502dd530b34b3fa4c6ac1 by daniel_dunbar:
[PackageLoading] Fix error handling in ManifestLoader.

edit: Sources/PackageLoading/ManifestLoader.swift
edit: Sources/PackageModel/Package.swift
edit: Tests/PackageLoadingTests/ManifestTests.swift

Commit 1a1abe59441230600dec207b99d6b979b287f2ed by daniel_dunbar:
[TestSupport] Add import required when building in Xcode.

edit: Sources/TestSupport/Resources.swift

Commit d1265f262de6ad82ad5ecebca9050bf5812ab9a1 by daniel_dunbar:
[PackageLoading] Introduce ManifestLoaderProtocol.

edit: Sources/PackageLoading/ManifestLoader.swift

Commit f78b6e51012e046e294ab8dd19fbe6eb30a493ac by daniel_dunbar:
[PackageGraph] Add adaptor for using DependencyResolver on packages.

add: Sources/PackageGraph/RepositoryPackageContainerProvider.swift
edit: Tests/PackageGraphTests/DependencyResolverTests.swift
edit: Package.swift
add: Tests/PackageGraphTests/RepositoryPackageContainerProviderTests.swift
edit: Sources/SourceControl/Repository.swift
edit: Tests/PackageGraphTests/XCTestManifests.swift

Commit 6e218c4e3e459b5f9391251153fa98876288e6e2 by dabrahams:
Revert "Moving [Custom]PlaygroundQuickLook[able]"

edit: packages/Python/lldbsuite/test/repl/quicklookobject/TestREPLQuickLookObject.py

Commit 1332ea5d6fec9693e0f7dc723b2e41fc06fbbdfb by lehewjr:
Build Fix: Missed that there was test

edit: TestFoundation/TestNSNumber.swift

Commit f71f65e565b0babb22030fe85b7be31c2702d5f8 by github:
Fix a macOS test failure in TestHTTPCookie. (#523)

edit: CoreFoundation/Locale.subproj/CFLocale.c
edit: Foundation/NSDateFormatter.swift
edit: CoreFoundation/NumberDate.subproj/CFTimeZone.c

Commit fc2157a78765a0b856141d7c7545806033d50b85 by anthony.parker:
Mark operators in protocols as 'static' [SE-0091] (#522)

edit: Foundation/NSScanner.swift

Commit 0821588275e3f7da332214f5fc549a44a69754a1 by github:
Remove missing test case (#532)

edit: TestFoundation/TestNSNumber.swift

Commit c6ecd76a08331fb5d447540cce41afe38efbcc44 by github:
Revert "Additional fixes for macOS test failure in TestHTTPCookie."

edit: Foundation/NSDateFormatter.swift
edit: CoreFoundation/Locale.subproj/CFLocale.c
edit: CoreFoundation/NumberDate.subproj/CFTimeZone.c


(Tony Parker) #2

This has been failing for too long, so I filed a JIRA and will shortly push a commit to disable the test.

https://bugs.swift.org/browse/SR-2332

- Tony

···

On Aug 12, 2016, at 9:26 AM, Daniel Dunbar <daniel_dunbar@apple.com> wrote:

Anyone know who/what is tracking this:

-- Testing: 19 tests, 12 threads --
FAIL: SwiftXCTestFunctionalTests :: Asynchronous/Predicates/Expectations/main.swift (10 of 19)
<>******************** TEST 'SwiftXCTestFunctionalTests :: Asynchronous/Predicates/Expectations/main.swift' FAILED ********************
Script:
--
/home/buildnode/disk2/workspace/oss-swift-package-linux-ubuntu-14_04/build/buildbot_linux/swift-linux-x86_64/bin/swiftc -Xlinker -rpath -Xlinker /home/buildnode/disk2/workspace/oss-swift-package-linux-ubuntu-14_04/build/buildbot_linux/xctest-linux-x86_64 -L /home/buildnode/disk2/workspace/oss-swift-package-linux-ubuntu-14_04/build/buildbot_linux/xctest-linux-x86_64 -I /home/buildnode/disk2/workspace/oss-swift-package-linux-ubuntu-14_04/build/buildbot_linux/xctest-linux-x86_64 -Xlinker -rpath -Xlinker /home/buildnode/disk2/workspace/oss-swift-package-linux-ubuntu-14_04/build/buildbot_linux/foundation-linux-x86_64/Foundation -L /home/buildnode/disk2/workspace/oss-swift-package-linux-ubuntu-14_04/build/buildbot_linux/foundation-linux-x86_64/Foundation -I /home/buildnode/disk2/workspace/oss-swift-package-linux-ubuntu-14_04/build/buildbot_linux/foundation-linux-x86_64/Foundation -I /home/buildnode/disk2/workspace/oss-swift-package-linux-ubuntu-14_04/build/buildbot_linux/foundation-linux-x86_64/Foundation/usr/lib/swift /home/buildnode/disk2/workspace/oss-swift-package-linux-ubuntu-14_04/swift-corelibs-xctest/Tests/Functional/Asynchronous/Predicates/Expectations/main.swift -o /home/buildnode/disk2/workspace/oss-swift-package-linux-ubuntu-14_04/swift-corelibs-xctest/Tests/Functional/Asynchronous/Predicates/Expectations/Output/Asynchronous-Predicates
/home/buildnode/disk2/workspace/oss-swift-package-linux-ubuntu-14_04/swift-corelibs-xctest/Tests/Functional/Asynchronous/Predicates/Expectations/Output/Asynchronous-Predicates > /home/buildnode/disk2/workspace/oss-swift-package-linux-ubuntu-14_04/swift-corelibs-xctest/Tests/Functional/Asynchronous/Predicates/Expectations/Output/main.swift.tmp || true
/home/buildnode/disk2/workspace/oss-swift-package-linux-ubuntu-14_04/swift-corelibs-xctest/Tests/Functional/xctest_checker/xctest_checker.py /home/buildnode/disk2/workspace/oss-swift-package-linux-ubuntu-14_04/swift-corelibs-xctest/Tests/Functional/Asynchronous/Predicates/Expectations/Output/main.swift.tmp /home/buildnode/disk2/workspace/oss-swift-package-linux-ubuntu-14_04/swift-corelibs-xctest/Tests/Functional/Asynchronous/Predicates/Expectations/main.swift
--
Exit Code: 1

Command Output (stdout):
--
Command 0: "/home/buildnode/disk2/workspace/oss-swift-package-linux-ubuntu-14_04/build/buildbot_linux/swift-linux-x86_64/bin/swiftc" "-Xlinker" "-rpath" "-Xlinker" "/home/buildnode/disk2/workspace/oss-swift-package-linux-ubuntu-14_04/build/buildbot_linux/xctest-linux-x86_64" "-L" "/home/buildnode/disk2/workspace/oss-swift-package-linux-ubuntu-14_04/build/buildbot_linux/xctest-linux-x86_64" "-I" "/home/buildnode/disk2/workspace/oss-swift-package-linux-ubuntu-14_04/build/buildbot_linux/xctest-linux-x86_64" "-Xlinker" "-rpath" "-Xlinker" "/home/buildnode/disk2/workspace/oss-swift-package-linux-ubuntu-14_04/build/buildbot_linux/foundation-linux-x86_64/Foundation" "-L" "/home/buildnode/disk2/workspace/oss-swift-package-linux-ubuntu-14_04/build/buildbot_linux/foundation-linux-x86_64/Foundation" "-I" "/home/buildnode/disk2/workspace/oss-swift-package-linux-ubuntu-14_04/build/buildbot_linux/foundation-linux-x86_64/Foundation" "-I" "/home/buildnode/disk2/workspace/oss-swift-package-linux-ubuntu-14_04/build/buildbot_linux/foundation-linux-x86_64/Foundation/usr/lib/swift" "/home/buildnode/disk2/workspace/oss-swift-package-linux-ubuntu-14_04/swift-corelibs-xctest/Tests/Functional/Asynchronous/Predicates/Expectations/main.swift" "-o" "/home/buildnode/disk2/workspace/oss-swift-package-linux-ubuntu-14_04/swift-corelibs-xctest/Tests/Functional/Asynchronous/Predicates/Expectations/Output/Asynchronous-Predicates"
Command 0 Result: 0
Command 0 Output:

Command 0 Stderr:
/home/buildnode/disk2/workspace/oss-swift-package-linux-ubuntu-14_04/swift-corelibs-xctest/Tests/Functional/Asynchronous/Predicates/Expectations/main.swift:23:9: warning: result of call to 'expectation(for:evaluatedWith:file:line:handler:)' is unused
        expectation(for: predicate, evaluatedWith: object)
        ^ ~~~~~~~~~~~~~~~~~~~~~~~~~~~~~~~~~~~~~~~
/home/buildnode/disk2/workspace/oss-swift-package-linux-ubuntu-14_04/swift-corelibs-xctest/Tests/Functional/Asynchronous/Predicates/Expectations/main.swift:33:9: warning: result of call to 'expectation(for:evaluatedWith:file:line:handler:)' is unused
        expectation(for: predicate, evaluatedWith: object)
        ^ ~~~~~~~~~~~~~~~~~~~~~~~~~~~~~~~~~~~~~~~
/home/buildnode/disk2/workspace/oss-swift-package-linux-ubuntu-14_04/swift-corelibs-xctest/Tests/Functional/Asynchronous/Predicates/Expectations/main.swift:48:9: warning: result of call to 'expectation(for:evaluatedWith:file:line:handler:)' is unused
        expectation(for: predicate, evaluatedWith: halfSecLaterDate)
        ^ ~~~~~~~~~~~~~~~~~~~~~~~~~~~~~~~~~~~~~~~~~~~~~~~~~
/home/buildnode/disk2/workspace/oss-swift-package-linux-ubuntu-14_04/swift-corelibs-xctest/Tests/Functional/Asynchronous/Predicates/Expectations/main.swift:62:9: warning: result of call to 'expectation(for:evaluatedWith:file:line:handler:)' is unused
        expectation(for: predicate, evaluatedWith: halfSecLaterDate)
        ^ ~~~~~~~~~~~~~~~~~~~~~~~~~~~~~~~~~~~~~~~~~~~~~~~~~

Command 1: "/home/buildnode/disk2/workspace/oss-swift-package-linux-ubuntu-14_04/swift-corelibs-xctest/Tests/Functional/Asynchronous/Predicates/Expectations/Output/Asynchronous-Predicates"
Command 1 Result: -7
Command 1 Output:
None

Command 1 Stderr:

Command 2: "true"
Command 2 Result: 0
Command 2 Output:

Command 2 Stderr:

Command 3: "/home/buildnode/disk2/workspace/oss-swift-package-linux-ubuntu-14_04/swift-corelibs-xctest/Tests/Functional/xctest_checker/xctest_checker.py" "/home/buildnode/disk2/workspace/oss-swift-package-linux-ubuntu-14_04/swift-corelibs-xctest/Tests/Functional/Asynchronous/Predicates/Expectations/Output/main.swift.tmp" "/home/buildnode/disk2/workspace/oss-swift-package-linux-ubuntu-14_04/swift-corelibs-xctest/Tests/Functional/Asynchronous/Predicates/Expectations/main.swift"
Command 3 Result: 1
Command 3 Output:

Command 3 Stderr:
Traceback (most recent call last):
  File "/home/buildnode/disk2/workspace/oss-swift-package-linux-ubuntu-14_04/swift-corelibs-xctest/Tests/Functional/xctest_checker/xctest_checker.py", line 15, in <module>
    xctest_checker.main.main()
  File "/home/buildnode/disk2/workspace/oss-swift-package-linux-ubuntu-14_04/swift-corelibs-xctest/Tests/Functional/xctest_checker/xctest_checker/main.py", line 61, in main
    compare.compare(args.actual, args.expected, args.check_prefix)
  File "/home/buildnode/disk2/workspace/oss-swift-package-linux-ubuntu-14_04/swift-corelibs-xctest/Tests/Functional/xctest_checker/xctest_checker/compare.py", line 85, in compare
    repr(expected_line)))
xctest_checker.error.XCTestCheckerError:
/home/buildnode/disk2/workspace/oss-swift-package-linux-ubuntu-14_04/swift-corelibs-xctest/Tests/Functional/Asynchronous/Predicates/Expectations/main.swift:53: There were more lines expected to appear than there were lines in the actual input. Unmet expectation: "Test Case 'PredicateExpectationsTestCase.test_immediatelyTrueDelayedFalsePredicateAndObject_passes' passed \\(\\d+\\.\\d+ <smb://d+//.//d+> seconds\\)."

--

********************

Testing Time: 2.03s
********************
Failing Tests (1):
    SwiftXCTestFunctionalTests :: Asynchronous/Predicates/Expectations/main.swift

  Expected Passes : 18
  Unexpected Failures: 1
xctest-build: SWIFT_EXEC=/home/buildnode/disk2/workspace/oss-swift-package-linux-ubuntu-14_04/build/buildbot_linux/swift-linux-x86_64/bin/swiftc BUILT_PRODUCTS_DIR=/home/buildnode/disk2/workspace/oss-swift-package-linux-ubuntu-14_04/build/buildbot_linux/xctest-linux-x86_64 FOUNDATION_BUILT_PRODUCTS_DIR=/home/buildnode/disk2/workspace/oss-swift-package-linux-ubuntu-14_04/build/buildbot_linux/foundation-linux-x86_64/Foundation CORE_FOUNDATION_BUILT_PRODUCTS_DIR=/home/buildnode/disk2/workspace/oss-swift-package-linux-ubuntu-14_04/build/buildbot_linux/foundation-linux-x86_64/Foundation/usr/lib/swift /home/buildnode/disk2/workspace/oss-swift-package-linux-ubuntu-14_04/llvm/utils/lit/lit.py -sv --no-progress-bar /home/buildnode/disk2/workspace/oss-swift-package-linux-ubuntu-14_04/swift-corelibs-xctest/Tests/Functional

  - Daniel

On Aug 11, 2016, at 7:29 PM, no-reply@swift.org <mailto:no-reply@swift.org> wrote:

New issue found!

[FAILURE] oss-swift-package-linux-ubuntu-14_04 [#1892]

Build URL: https://ci.swift.org/job/oss-swift-package-linux-ubuntu-14_04/1892/
Project: oss-swift-package-linux-ubuntu-14_04
Date of build: Thu, 11 Aug 2016 18:35:48 -0700
Build duration: 53 min
Identified problems:

Regression test failed: This build failed because a regression test in the test suite FAILed. Below is a list of all errors:
Indication 1 <https://ci.swift.org//job/oss-swift-package-linux-ubuntu-14_04/1892/consoleFull#-936285465fca400bf-2f4a-462e-b517-e058d770b2d7>
Changes

Commit 54bc52eb1b5c99c127ed132548c3d28e605e0141 by jgroff:
Sema: Assigning vars of generic param type should not use runtime

edit: lib/Sema/TypeCheckCaptures.cpp
edit: test/ClangModules/objc_bridging_generics.swift

Commit a56d6ac0685bdcba6994331d56ad3c33582b7c54 by mgottesman:
[build-script] Move llvm-targets-to-build to

edit: utils/build-script-impl
add: utils/swift_build_support/tests/products/test_llvm.py
edit: utils/build-presets.ini
edit: utils/build-script
edit: utils/swift_build_support/swift_build_support/products/llvm.py

Commit 14b2dd52967b6cfb2957ec907fc04ad2b82abf0d by mgottesman:
[build-script] Move computation of LLVM_ENABLE_ASSERTIONS from

edit: utils/build-script
edit: utils/build-script-impl
edit: utils/swift_build_support/swift_build_support/products/llvm.py
edit: utils/swift_build_support/tests/products/test_llvm.py

Commit 454ee8a8d9314b33487cb3a5ffd769c6753cc77b by blangmuir:
[fixcode] Add ( as AnyObject) fixit to the whitelist

edit: test/FixCode/fixits-apply.swift.result
edit: test/FixCode/fixits-apply.swift
edit: lib/FrontendTool/FrontendTool.cpp

Commit 390c1a45fb9b91276f3c995ecbf6f2ff7742012a by aschwaighofer:
Fix IRGen for associated type witness accessor functions in generic

edit: lib/IRGen/GenProto.cpp
edit: test/IRGen/same_type_constraints.swift

Commit ec539d6abf8aabb747198f41c68cbcde32c28c47 by blangmuir:
[fixcode] Enabled protocol<...> fixits

edit: test/FixCode/fixits-apply.swift.result
edit: lib/FrontendTool/FrontendTool.cpp
edit: test/FixCode/fixits-apply.swift

Commit b5864f87f3ff436d8b332067f91a8a441b3a5fed by harlan:
[coverage] Add cov2json tool for serializing code coverage

edit: tools/CMakeLists.txt
add: tools/cov2json/JSONWriter.h
add: tools/cov2json/CMakeLists.txt
add: tools/cov2json/ProfileData.h
add: tools/cov2json/ProfileData.cpp
add: tools/cov2json/main.cpp

Commit 1cc7700d202c25d430aead49696c9b6ec8bb70ef by xin_tong:
Change SE-128 to SE-0128 and a grammar fix.

edit: CHANGELOG.md

Commit d25b6a5c2834dfcad56e745fb6ff22c1eac2b66d by jgroff:
Sema/SILGen: Do erasure from pseudogeneric T to Any without requiring

edit: lib/Sema/TypeCheckCaptures.cpp
edit: test/ClangModules/objc_bridging_generics.swift
edit: lib/SILGen/SILGenConvert.cpp
edit: test/SILGen/objc_bridging_any.swift

Commit f3a5d3a3360efa93b89914c8a462202c6c390724 by jgroff:
Sema: Dynamic casts to ObjC generic classes don't use the type metadata

edit: test/ClangModules/objc_bridging_generics.swift
edit: lib/Sema/TypeCheckCaptures.cpp

Commit 69918a966d2c0b34d83669ffc8809182f587dca0 by kyrtzidis:
[ASTPrinter] Fix printing of nested typealias types and make it

edit: test/decl/protocol/protocols.swift
edit: test/FixCode/fixits-apply.swift
edit: test/IDE/complete_from_foundation_overlay.swift
edit: test/stmt/foreach.swift
edit: include/swift/AST/PrintOptions.h
edit: test/Constraints/same_types.swift
edit: test/IDE/complete_from_stdlib.swift
edit: test/Constraints/diagnostics.swift
edit: lib/AST/ASTPrinter.cpp
edit: test/SourceKit/InterfaceGen/gen_stdlib.swift
edit: test/IDE/complete_associated_types.swift
edit: test/IDE/print_synthesized_extensions.swift
edit: test/TypeCoercion/integer_literals.swift
edit: test/decl/protocol/req/func.swift
edit: test/decl/protocol/conforms/associated_type.swift
edit: test/IDE/complete_crashes.swift
edit: test/ClangModules/enum-with-target.swift
edit: test/attr/attr_specialize.swift
edit: test/Generics/superclass_constraint.swift
edit: test/FixCode/fixits-apply.swift.result
edit: test/Generics/generic_types.swift
edit: test/IDE/print_ast_tc_decls.swift
edit: test/decl/ext/protocol.swift
edit: test/multifile/Inputs/external-protocol-conformance/A.swift
edit: test/IDE/complete_literal.swift

Commit 126602d7dd30d263a753a94574f5f4e6cbf88bfa by kyrtzidis:
[test] Update 'validation-test/stdlib/CollectionDiagnostics.swift'

edit: validation-test/stdlib/CollectionDiagnostics.swift

Commit aa3d2e65f32dea640f8eb8b30daf843e44061a54 by kyrtzidis:
[ASTPrinter] Simplify code using 'getDeclaredType()', as suggested by

edit: lib/AST/ASTPrinter.cpp

Commit f65ad810df9280c55649a4257ad4375d96645151 by github:
Check protocol witnesses using access scopes. (#4176)

edit: test/Sema/accessibility.swift
edit: lib/Sema/TypeCheckDecl.cpp
edit: lib/Sema/MiscDiagnostics.cpp
edit: lib/Sema/TypeCheckProtocol.cpp
edit: lib/Sema/MiscDiagnostics.h
edit: test/NameBinding/accessibility.swift

Commit 753642e0050d9de45a171f8751e757916895d29a by mark.lacey:
Special-case error for indexing into a nil literal.

edit: lib/Sema/CSDiag.cpp
edit: test/decl/subscript/subscripting.swift
edit: include/swift/AST/DiagnosticsSema.def

Commit 148e25dc03f8f6ceabd15603e19e0adf09dcc4e9 by github:
Provide the '@escaping' fix-it for any call-site escaping mismatch.

edit: test/attr/attr_escaping.swift
edit: lib/Sema/CSDiag.cpp

Commit 133c63c44b95614180bcd16a7bdea6cba1638d69 by github:
[Parse] Fix fix-it for old-style 'where' clauses. (#4198)

edit: test/Parse/deprecated_where.swift
edit: lib/Parse/ParseGeneric.cpp

Commit 42527ed18b275e4fe7f4dea0ede604319a20008a by jgroff:
IRGen: Don't attempt to emit debug info for type-erased generic params.

edit: lib/IRGen/GenMeta.h
edit: lib/IRGen/IRGenSIL.cpp
edit: lib/IRGen/GenMeta.cpp
add: test/IRGen/objc_generic_class_debug_info.swift

Commit a4a9d19b3fe3fbddcd225baa31157689e4cdb009 by jgroff:
Sema: Diagnose init calls as uses of generic params.

edit: test/ClangModules/objc_bridging_generics.swift
edit: lib/Sema/TypeCheckCaptures.cpp

Commit 294bbd8e17c5893514599e52d02a37ce4e9ae24d by github:
[Parse] Attach 'inout' to Swift 2 unparenthesized function params.

edit: test/type/types.swift
edit: lib/Parse/ParsePattern.cpp

Commit 0bb0c9ea41f26f6d940bb0fc6e66d90a28b21d92 by daniel_dunbar:
[TestSupport] Add convenience initializers for testing FS instances.

edit: Tests/PackageLoadingTests/ConventionTests.swift
add: Sources/TestSupport/FileSystemExtensions.swift
edit: Tests/PackageLoadingTests/ModuleMapGenerationTests.swift

Commit 66408be65736ad2dfc314a57a00ed5b91b0b1a99 by daniel_dunbar:
[TestSupport] Add missing target dependency.

edit: Package.swift

Commit 5013cd7028e87e41145502dd530b34b3fa4c6ac1 by daniel_dunbar:
[PackageLoading] Fix error handling in ManifestLoader.

edit: Sources/PackageLoading/ManifestLoader.swift
edit: Sources/PackageModel/Package.swift
edit: Tests/PackageLoadingTests/ManifestTests.swift

Commit 1a1abe59441230600dec207b99d6b979b287f2ed by daniel_dunbar:
[TestSupport] Add import required when building in Xcode.

edit: Sources/TestSupport/Resources.swift

Commit d1265f262de6ad82ad5ecebca9050bf5812ab9a1 by daniel_dunbar:
[PackageLoading] Introduce ManifestLoaderProtocol.

edit: Sources/PackageLoading/ManifestLoader.swift

Commit f78b6e51012e046e294ab8dd19fbe6eb30a493ac by daniel_dunbar:
[PackageGraph] Add adaptor for using DependencyResolver on packages.

add: Sources/PackageGraph/RepositoryPackageContainerProvider.swift
edit: Tests/PackageGraphTests/DependencyResolverTests.swift
edit: Package.swift
add: Tests/PackageGraphTests/RepositoryPackageContainerProviderTests.swift
edit: Sources/SourceControl/Repository.swift
edit: Tests/PackageGraphTests/XCTestManifests.swift

Commit 6e218c4e3e459b5f9391251153fa98876288e6e2 by dabrahams:
Revert "Moving [Custom]PlaygroundQuickLook[able]"

edit: packages/Python/lldbsuite/test/repl/quicklookobject/TestREPLQuickLookObject.py

Commit 1332ea5d6fec9693e0f7dc723b2e41fc06fbbdfb by lehewjr:
Build Fix: Missed that there was test

edit: TestFoundation/TestNSNumber.swift

Commit f71f65e565b0babb22030fe85b7be31c2702d5f8 by github:
Fix a macOS test failure in TestHTTPCookie. (#523)

edit: CoreFoundation/Locale.subproj/CFLocale.c
edit: Foundation/NSDateFormatter.swift
edit: CoreFoundation/NumberDate.subproj/CFTimeZone.c

Commit fc2157a78765a0b856141d7c7545806033d50b85 by anthony.parker:
Mark operators in protocols as 'static' [SE-0091] (#522)

edit: Foundation/NSScanner.swift

Commit 0821588275e3f7da332214f5fc549a44a69754a1 by github:
Remove missing test case (#532)

edit: TestFoundation/TestNSNumber.swift

Commit c6ecd76a08331fb5d447540cce41afe38efbcc44 by github:
Revert "Additional fixes for macOS test failure in TestHTTPCookie."

edit: Foundation/NSDateFormatter.swift
edit: CoreFoundation/Locale.subproj/CFLocale.c
edit: CoreFoundation/NumberDate.subproj/CFTimeZone.c


(Daniel Dunbar) #3

Thanks Tony!

- Daniel

···

On Aug 12, 2016, at 3:34 PM, Tony Parker <anthony.parker@apple.com> wrote:

This has been failing for too long, so I filed a JIRA and will shortly push a commit to disable the test.

https://bugs.swift.org/browse/SR-2332

- Tony

On Aug 12, 2016, at 9:26 AM, Daniel Dunbar <daniel_dunbar@apple.com <mailto:daniel_dunbar@apple.com>> wrote:

Anyone know who/what is tracking this:

-- Testing: 19 tests, 12 threads --
FAIL: SwiftXCTestFunctionalTests :: Asynchronous/Predicates/Expectations/main.swift (10 of 19)
<>******************** TEST 'SwiftXCTestFunctionalTests :: Asynchronous/Predicates/Expectations/main.swift' FAILED ********************
Script:
--
/home/buildnode/disk2/workspace/oss-swift-package-linux-ubuntu-14_04/build/buildbot_linux/swift-linux-x86_64/bin/swiftc -Xlinker -rpath -Xlinker /home/buildnode/disk2/workspace/oss-swift-package-linux-ubuntu-14_04/build/buildbot_linux/xctest-linux-x86_64 -L /home/buildnode/disk2/workspace/oss-swift-package-linux-ubuntu-14_04/build/buildbot_linux/xctest-linux-x86_64 -I /home/buildnode/disk2/workspace/oss-swift-package-linux-ubuntu-14_04/build/buildbot_linux/xctest-linux-x86_64 -Xlinker -rpath -Xlinker /home/buildnode/disk2/workspace/oss-swift-package-linux-ubuntu-14_04/build/buildbot_linux/foundation-linux-x86_64/Foundation -L /home/buildnode/disk2/workspace/oss-swift-package-linux-ubuntu-14_04/build/buildbot_linux/foundation-linux-x86_64/Foundation -I /home/buildnode/disk2/workspace/oss-swift-package-linux-ubuntu-14_04/build/buildbot_linux/foundation-linux-x86_64/Foundation -I /home/buildnode/disk2/workspace/oss-swift-package-linux-ubuntu-14_04/build/buildbot_linux/foundation-linux-x86_64/Foundation/usr/lib/swift /home/buildnode/disk2/workspace/oss-swift-package-linux-ubuntu-14_04/swift-corelibs-xctest/Tests/Functional/Asynchronous/Predicates/Expectations/main.swift -o /home/buildnode/disk2/workspace/oss-swift-package-linux-ubuntu-14_04/swift-corelibs-xctest/Tests/Functional/Asynchronous/Predicates/Expectations/Output/Asynchronous-Predicates
/home/buildnode/disk2/workspace/oss-swift-package-linux-ubuntu-14_04/swift-corelibs-xctest/Tests/Functional/Asynchronous/Predicates/Expectations/Output/Asynchronous-Predicates > /home/buildnode/disk2/workspace/oss-swift-package-linux-ubuntu-14_04/swift-corelibs-xctest/Tests/Functional/Asynchronous/Predicates/Expectations/Output/main.swift.tmp || true
/home/buildnode/disk2/workspace/oss-swift-package-linux-ubuntu-14_04/swift-corelibs-xctest/Tests/Functional/xctest_checker/xctest_checker.py /home/buildnode/disk2/workspace/oss-swift-package-linux-ubuntu-14_04/swift-corelibs-xctest/Tests/Functional/Asynchronous/Predicates/Expectations/Output/main.swift.tmp /home/buildnode/disk2/workspace/oss-swift-package-linux-ubuntu-14_04/swift-corelibs-xctest/Tests/Functional/Asynchronous/Predicates/Expectations/main.swift
--
Exit Code: 1

Command Output (stdout):
--
Command 0: "/home/buildnode/disk2/workspace/oss-swift-package-linux-ubuntu-14_04/build/buildbot_linux/swift-linux-x86_64/bin/swiftc" "-Xlinker" "-rpath" "-Xlinker" "/home/buildnode/disk2/workspace/oss-swift-package-linux-ubuntu-14_04/build/buildbot_linux/xctest-linux-x86_64" "-L" "/home/buildnode/disk2/workspace/oss-swift-package-linux-ubuntu-14_04/build/buildbot_linux/xctest-linux-x86_64" "-I" "/home/buildnode/disk2/workspace/oss-swift-package-linux-ubuntu-14_04/build/buildbot_linux/xctest-linux-x86_64" "-Xlinker" "-rpath" "-Xlinker" "/home/buildnode/disk2/workspace/oss-swift-package-linux-ubuntu-14_04/build/buildbot_linux/foundation-linux-x86_64/Foundation" "-L" "/home/buildnode/disk2/workspace/oss-swift-package-linux-ubuntu-14_04/build/buildbot_linux/foundation-linux-x86_64/Foundation" "-I" "/home/buildnode/disk2/workspace/oss-swift-package-linux-ubuntu-14_04/build/buildbot_linux/foundation-linux-x86_64/Foundation" "-I" "/home/buildnode/disk2/workspace/oss-swift-package-linux-ubuntu-14_04/build/buildbot_linux/foundation-linux-x86_64/Foundation/usr/lib/swift" "/home/buildnode/disk2/workspace/oss-swift-package-linux-ubuntu-14_04/swift-corelibs-xctest/Tests/Functional/Asynchronous/Predicates/Expectations/main.swift" "-o" "/home/buildnode/disk2/workspace/oss-swift-package-linux-ubuntu-14_04/swift-corelibs-xctest/Tests/Functional/Asynchronous/Predicates/Expectations/Output/Asynchronous-Predicates"
Command 0 Result: 0
Command 0 Output:

Command 0 Stderr:
/home/buildnode/disk2/workspace/oss-swift-package-linux-ubuntu-14_04/swift-corelibs-xctest/Tests/Functional/Asynchronous/Predicates/Expectations/main.swift:23:9: warning: result of call to 'expectation(for:evaluatedWith:file:line:handler:)' is unused
        expectation(for: predicate, evaluatedWith: object)
        ^ ~~~~~~~~~~~~~~~~~~~~~~~~~~~~~~~~~~~~~~~
/home/buildnode/disk2/workspace/oss-swift-package-linux-ubuntu-14_04/swift-corelibs-xctest/Tests/Functional/Asynchronous/Predicates/Expectations/main.swift:33:9: warning: result of call to 'expectation(for:evaluatedWith:file:line:handler:)' is unused
        expectation(for: predicate, evaluatedWith: object)
        ^ ~~~~~~~~~~~~~~~~~~~~~~~~~~~~~~~~~~~~~~~
/home/buildnode/disk2/workspace/oss-swift-package-linux-ubuntu-14_04/swift-corelibs-xctest/Tests/Functional/Asynchronous/Predicates/Expectations/main.swift:48:9: warning: result of call to 'expectation(for:evaluatedWith:file:line:handler:)' is unused
        expectation(for: predicate, evaluatedWith: halfSecLaterDate)
        ^ ~~~~~~~~~~~~~~~~~~~~~~~~~~~~~~~~~~~~~~~~~~~~~~~~~
/home/buildnode/disk2/workspace/oss-swift-package-linux-ubuntu-14_04/swift-corelibs-xctest/Tests/Functional/Asynchronous/Predicates/Expectations/main.swift:62:9: warning: result of call to 'expectation(for:evaluatedWith:file:line:handler:)' is unused
        expectation(for: predicate, evaluatedWith: halfSecLaterDate)
        ^ ~~~~~~~~~~~~~~~~~~~~~~~~~~~~~~~~~~~~~~~~~~~~~~~~~

Command 1: "/home/buildnode/disk2/workspace/oss-swift-package-linux-ubuntu-14_04/swift-corelibs-xctest/Tests/Functional/Asynchronous/Predicates/Expectations/Output/Asynchronous-Predicates"
Command 1 Result: -7
Command 1 Output:
None

Command 1 Stderr:

Command 2: "true"
Command 2 Result: 0
Command 2 Output:

Command 2 Stderr:

Command 3: "/home/buildnode/disk2/workspace/oss-swift-package-linux-ubuntu-14_04/swift-corelibs-xctest/Tests/Functional/xctest_checker/xctest_checker.py" "/home/buildnode/disk2/workspace/oss-swift-package-linux-ubuntu-14_04/swift-corelibs-xctest/Tests/Functional/Asynchronous/Predicates/Expectations/Output/main.swift.tmp" "/home/buildnode/disk2/workspace/oss-swift-package-linux-ubuntu-14_04/swift-corelibs-xctest/Tests/Functional/Asynchronous/Predicates/Expectations/main.swift"
Command 3 Result: 1
Command 3 Output:

Command 3 Stderr:
Traceback (most recent call last):
  File "/home/buildnode/disk2/workspace/oss-swift-package-linux-ubuntu-14_04/swift-corelibs-xctest/Tests/Functional/xctest_checker/xctest_checker.py", line 15, in <module>
    xctest_checker.main.main()
  File "/home/buildnode/disk2/workspace/oss-swift-package-linux-ubuntu-14_04/swift-corelibs-xctest/Tests/Functional/xctest_checker/xctest_checker/main.py", line 61, in main
    compare.compare(args.actual, args.expected, args.check_prefix)
  File "/home/buildnode/disk2/workspace/oss-swift-package-linux-ubuntu-14_04/swift-corelibs-xctest/Tests/Functional/xctest_checker/xctest_checker/compare.py", line 85, in compare
    repr(expected_line)))
xctest_checker.error.XCTestCheckerError:
/home/buildnode/disk2/workspace/oss-swift-package-linux-ubuntu-14_04/swift-corelibs-xctest/Tests/Functional/Asynchronous/Predicates/Expectations/main.swift:53: There were more lines expected to appear than there were lines in the actual input. Unmet expectation: "Test Case 'PredicateExpectationsTestCase.test_immediatelyTrueDelayedFalsePredicateAndObject_passes' passed \\(\\d+\\.\\d+ <smb://d+//.//d+> seconds\\)."

--

********************

Testing Time: 2.03s
********************
Failing Tests (1):
    SwiftXCTestFunctionalTests :: Asynchronous/Predicates/Expectations/main.swift

  Expected Passes : 18
  Unexpected Failures: 1
xctest-build: SWIFT_EXEC=/home/buildnode/disk2/workspace/oss-swift-package-linux-ubuntu-14_04/build/buildbot_linux/swift-linux-x86_64/bin/swiftc BUILT_PRODUCTS_DIR=/home/buildnode/disk2/workspace/oss-swift-package-linux-ubuntu-14_04/build/buildbot_linux/xctest-linux-x86_64 FOUNDATION_BUILT_PRODUCTS_DIR=/home/buildnode/disk2/workspace/oss-swift-package-linux-ubuntu-14_04/build/buildbot_linux/foundation-linux-x86_64/Foundation CORE_FOUNDATION_BUILT_PRODUCTS_DIR=/home/buildnode/disk2/workspace/oss-swift-package-linux-ubuntu-14_04/build/buildbot_linux/foundation-linux-x86_64/Foundation/usr/lib/swift /home/buildnode/disk2/workspace/oss-swift-package-linux-ubuntu-14_04/llvm/utils/lit/lit.py -sv --no-progress-bar /home/buildnode/disk2/workspace/oss-swift-package-linux-ubuntu-14_04/swift-corelibs-xctest/Tests/Functional

  - Daniel

On Aug 11, 2016, at 7:29 PM, no-reply@swift.org <mailto:no-reply@swift.org> wrote:

New issue found!

[FAILURE] oss-swift-package-linux-ubuntu-14_04 [#1892]

Build URL: https://ci.swift.org/job/oss-swift-package-linux-ubuntu-14_04/1892/
Project: oss-swift-package-linux-ubuntu-14_04
Date of build: Thu, 11 Aug 2016 18:35:48 -0700
Build duration: 53 min
Identified problems:

Regression test failed: This build failed because a regression test in the test suite FAILed. Below is a list of all errors:
Indication 1 <https://ci.swift.org//job/oss-swift-package-linux-ubuntu-14_04/1892/consoleFull#-936285465fca400bf-2f4a-462e-b517-e058d770b2d7>
Changes

Commit 54bc52eb1b5c99c127ed132548c3d28e605e0141 by jgroff:
Sema: Assigning vars of generic param type should not use runtime

edit: lib/Sema/TypeCheckCaptures.cpp
edit: test/ClangModules/objc_bridging_generics.swift

Commit a56d6ac0685bdcba6994331d56ad3c33582b7c54 by mgottesman:
[build-script] Move llvm-targets-to-build to

edit: utils/build-script-impl
add: utils/swift_build_support/tests/products/test_llvm.py
edit: utils/build-presets.ini
edit: utils/build-script
edit: utils/swift_build_support/swift_build_support/products/llvm.py

Commit 14b2dd52967b6cfb2957ec907fc04ad2b82abf0d by mgottesman:
[build-script] Move computation of LLVM_ENABLE_ASSERTIONS from

edit: utils/build-script
edit: utils/build-script-impl
edit: utils/swift_build_support/swift_build_support/products/llvm.py
edit: utils/swift_build_support/tests/products/test_llvm.py

Commit 454ee8a8d9314b33487cb3a5ffd769c6753cc77b by blangmuir:
[fixcode] Add ( as AnyObject) fixit to the whitelist

edit: test/FixCode/fixits-apply.swift.result
edit: test/FixCode/fixits-apply.swift
edit: lib/FrontendTool/FrontendTool.cpp

Commit 390c1a45fb9b91276f3c995ecbf6f2ff7742012a by aschwaighofer:
Fix IRGen for associated type witness accessor functions in generic

edit: lib/IRGen/GenProto.cpp
edit: test/IRGen/same_type_constraints.swift

Commit ec539d6abf8aabb747198f41c68cbcde32c28c47 by blangmuir:
[fixcode] Enabled protocol<...> fixits

edit: test/FixCode/fixits-apply.swift.result
edit: lib/FrontendTool/FrontendTool.cpp
edit: test/FixCode/fixits-apply.swift

Commit b5864f87f3ff436d8b332067f91a8a441b3a5fed by harlan:
[coverage] Add cov2json tool for serializing code coverage

edit: tools/CMakeLists.txt
add: tools/cov2json/JSONWriter.h
add: tools/cov2json/CMakeLists.txt
add: tools/cov2json/ProfileData.h
add: tools/cov2json/ProfileData.cpp
add: tools/cov2json/main.cpp

Commit 1cc7700d202c25d430aead49696c9b6ec8bb70ef by xin_tong:
Change SE-128 to SE-0128 and a grammar fix.

edit: CHANGELOG.md

Commit d25b6a5c2834dfcad56e745fb6ff22c1eac2b66d by jgroff:
Sema/SILGen: Do erasure from pseudogeneric T to Any without requiring

edit: lib/Sema/TypeCheckCaptures.cpp
edit: test/ClangModules/objc_bridging_generics.swift
edit: lib/SILGen/SILGenConvert.cpp
edit: test/SILGen/objc_bridging_any.swift

Commit f3a5d3a3360efa93b89914c8a462202c6c390724 by jgroff:
Sema: Dynamic casts to ObjC generic classes don't use the type metadata

edit: test/ClangModules/objc_bridging_generics.swift
edit: lib/Sema/TypeCheckCaptures.cpp

Commit 69918a966d2c0b34d83669ffc8809182f587dca0 by kyrtzidis:
[ASTPrinter] Fix printing of nested typealias types and make it

edit: test/decl/protocol/protocols.swift
edit: test/FixCode/fixits-apply.swift
edit: test/IDE/complete_from_foundation_overlay.swift
edit: test/stmt/foreach.swift
edit: include/swift/AST/PrintOptions.h
edit: test/Constraints/same_types.swift
edit: test/IDE/complete_from_stdlib.swift
edit: test/Constraints/diagnostics.swift
edit: lib/AST/ASTPrinter.cpp
edit: test/SourceKit/InterfaceGen/gen_stdlib.swift
edit: test/IDE/complete_associated_types.swift
edit: test/IDE/print_synthesized_extensions.swift
edit: test/TypeCoercion/integer_literals.swift
edit: test/decl/protocol/req/func.swift
edit: test/decl/protocol/conforms/associated_type.swift
edit: test/IDE/complete_crashes.swift
edit: test/ClangModules/enum-with-target.swift
edit: test/attr/attr_specialize.swift
edit: test/Generics/superclass_constraint.swift
edit: test/FixCode/fixits-apply.swift.result
edit: test/Generics/generic_types.swift
edit: test/IDE/print_ast_tc_decls.swift
edit: test/decl/ext/protocol.swift
edit: test/multifile/Inputs/external-protocol-conformance/A.swift
edit: test/IDE/complete_literal.swift

Commit 126602d7dd30d263a753a94574f5f4e6cbf88bfa by kyrtzidis:
[test] Update 'validation-test/stdlib/CollectionDiagnostics.swift'

edit: validation-test/stdlib/CollectionDiagnostics.swift

Commit aa3d2e65f32dea640f8eb8b30daf843e44061a54 by kyrtzidis:
[ASTPrinter] Simplify code using 'getDeclaredType()', as suggested by

edit: lib/AST/ASTPrinter.cpp

Commit f65ad810df9280c55649a4257ad4375d96645151 by github:
Check protocol witnesses using access scopes. (#4176)

edit: test/Sema/accessibility.swift
edit: lib/Sema/TypeCheckDecl.cpp
edit: lib/Sema/MiscDiagnostics.cpp
edit: lib/Sema/TypeCheckProtocol.cpp
edit: lib/Sema/MiscDiagnostics.h
edit: test/NameBinding/accessibility.swift

Commit 753642e0050d9de45a171f8751e757916895d29a by mark.lacey:
Special-case error for indexing into a nil literal.

edit: lib/Sema/CSDiag.cpp
edit: test/decl/subscript/subscripting.swift
edit: include/swift/AST/DiagnosticsSema.def

Commit 148e25dc03f8f6ceabd15603e19e0adf09dcc4e9 by github:
Provide the '@escaping' fix-it for any call-site escaping mismatch.

edit: test/attr/attr_escaping.swift
edit: lib/Sema/CSDiag.cpp

Commit 133c63c44b95614180bcd16a7bdea6cba1638d69 by github:
[Parse] Fix fix-it for old-style 'where' clauses. (#4198)

edit: test/Parse/deprecated_where.swift
edit: lib/Parse/ParseGeneric.cpp

Commit 42527ed18b275e4fe7f4dea0ede604319a20008a by jgroff:
IRGen: Don't attempt to emit debug info for type-erased generic params.

edit: lib/IRGen/GenMeta.h
edit: lib/IRGen/IRGenSIL.cpp
edit: lib/IRGen/GenMeta.cpp
add: test/IRGen/objc_generic_class_debug_info.swift

Commit a4a9d19b3fe3fbddcd225baa31157689e4cdb009 by jgroff:
Sema: Diagnose init calls as uses of generic params.

edit: test/ClangModules/objc_bridging_generics.swift
edit: lib/Sema/TypeCheckCaptures.cpp

Commit 294bbd8e17c5893514599e52d02a37ce4e9ae24d by github:
[Parse] Attach 'inout' to Swift 2 unparenthesized function params.

edit: test/type/types.swift
edit: lib/Parse/ParsePattern.cpp

Commit 0bb0c9ea41f26f6d940bb0fc6e66d90a28b21d92 by daniel_dunbar:
[TestSupport] Add convenience initializers for testing FS instances.

edit: Tests/PackageLoadingTests/ConventionTests.swift
add: Sources/TestSupport/FileSystemExtensions.swift
edit: Tests/PackageLoadingTests/ModuleMapGenerationTests.swift

Commit 66408be65736ad2dfc314a57a00ed5b91b0b1a99 by daniel_dunbar:
[TestSupport] Add missing target dependency.

edit: Package.swift

Commit 5013cd7028e87e41145502dd530b34b3fa4c6ac1 by daniel_dunbar:
[PackageLoading] Fix error handling in ManifestLoader.

edit: Sources/PackageLoading/ManifestLoader.swift
edit: Sources/PackageModel/Package.swift
edit: Tests/PackageLoadingTests/ManifestTests.swift

Commit 1a1abe59441230600dec207b99d6b979b287f2ed by daniel_dunbar:
[TestSupport] Add import required when building in Xcode.

edit: Sources/TestSupport/Resources.swift

Commit d1265f262de6ad82ad5ecebca9050bf5812ab9a1 by daniel_dunbar:
[PackageLoading] Introduce ManifestLoaderProtocol.

edit: Sources/PackageLoading/ManifestLoader.swift

Commit f78b6e51012e046e294ab8dd19fbe6eb30a493ac by daniel_dunbar:
[PackageGraph] Add adaptor for using DependencyResolver on packages.

add: Sources/PackageGraph/RepositoryPackageContainerProvider.swift
edit: Tests/PackageGraphTests/DependencyResolverTests.swift
edit: Package.swift
add: Tests/PackageGraphTests/RepositoryPackageContainerProviderTests.swift
edit: Sources/SourceControl/Repository.swift
edit: Tests/PackageGraphTests/XCTestManifests.swift

Commit 6e218c4e3e459b5f9391251153fa98876288e6e2 by dabrahams:
Revert "Moving [Custom]PlaygroundQuickLook[able]"

edit: packages/Python/lldbsuite/test/repl/quicklookobject/TestREPLQuickLookObject.py

Commit 1332ea5d6fec9693e0f7dc723b2e41fc06fbbdfb by lehewjr:
Build Fix: Missed that there was test

edit: TestFoundation/TestNSNumber.swift

Commit f71f65e565b0babb22030fe85b7be31c2702d5f8 by github:
Fix a macOS test failure in TestHTTPCookie. (#523)

edit: CoreFoundation/Locale.subproj/CFLocale.c
edit: Foundation/NSDateFormatter.swift
edit: CoreFoundation/NumberDate.subproj/CFTimeZone.c

Commit fc2157a78765a0b856141d7c7545806033d50b85 by anthony.parker:
Mark operators in protocols as 'static' [SE-0091] (#522)

edit: Foundation/NSScanner.swift

Commit 0821588275e3f7da332214f5fc549a44a69754a1 by github:
Remove missing test case (#532)

edit: TestFoundation/TestNSNumber.swift

Commit c6ecd76a08331fb5d447540cce41afe38efbcc44 by github:
Revert "Additional fixes for macOS test failure in TestHTTPCookie."

edit: Foundation/NSDateFormatter.swift
edit: CoreFoundation/Locale.subproj/CFLocale.c
edit: CoreFoundation/NumberDate.subproj/CFTimeZone.c