[Swift CI] Build Still Failing: OSS - Swift Package - OS X (master) #156

New issue found!

This is still the issue with libresilient_struct.dylib. It complains about a missing code signature. Slava, do you know what might be wrong here?

19:29:30 dyld: Library not loaded: /Users/buildnode/jenkins/workspace/oss-swift-package-osx/build/buildbot_osx/swift-macosx-x86_64/test-iphonesimulator-x86_64/Interpreter/Output/class_resilience.swift.tmp/libresilient_struct.dylib
19:29:30 Referenced from: /Users/buildnode/jenkins/workspace/oss-swift-package-osx/build/buildbot_osx/swift-macosx-x86_64/test-iphonesimulator-x86_64/Interpreter/Output/class_resilience.swift.tmp/main
19:29:30 Reason: no suitable image found. Did find:
19:29:30 /Users/buildnode/jenkins/workspace/oss-swift-package-osx/build/buildbot_osx/swift-macosx-x86_64/test-iphonesimulator-x86_64/Interpreter/Output/class_resilience.swift.tmp/libresilient_struct.dylib: required code signature missing for '/Users/buildnode/jenkins/workspace/oss-swift-package-osx/build/buildbot_osx/swift-macosx-x86_64/test-iphonesimulator-x86_64/Interpreter/Output/class_resilience.swift.tmp/libresilient_struct.dylib'

···

On Aug 29, 2017, at 5:39 PM, no-reply@swift.org wrote:

New issue found!

[FAILURE] oss-swift-package-osx [#156]

Build URL: https://ci.swift.org/job/oss-swift-package-osx/156/
Project: oss-swift-package-osx
Date of build: Tue, 29 Aug 2017 18:01:42 -0500
Build duration: 1 hr 38 min
Identified problems:

Regression test failed: This build failed because a regression test in the test suite FAILed. Below is a list of all errors:
Indication 1 <https://ci.swift.org//job/oss-swift-package-osx/156/consoleFull#-1196818926ba62d58e-7248-467b-91e0-c7508d5cf947>
Changes

Commit 2700fce74fa254447cb672a550192067eb2767d2 by mgottesman:
[silgen] Add a "fake" destroy in objc destructors.

edit: test/SILGen/objc_dealloc.swift
edit: lib/SILGen/SILGenDestructor.cpp

Commit 354a13a8dd9ba0a9d9d73d66a8ba6f64e6c06f9a by mracek:
Fix LongRefcounting.cpp to update test expectations after the error

edit: unittests/runtime/LongTests/LongRefcounting.cpp

Commit 7f29b362d68eb990a592257850aabadb24de61df by github:
SourceKitd: Rename SemaToken to ResolvedCursorInfo. NFC (#11680)

edit: lib/IDE/Refactoring.cpp
edit: tools/SourceKit/tools/sourcekitd/lib/API/Requests.cpp
edit: tools/swift-ide-test/swift-ide-test.cpp
edit: include/swift/IDE/Refactoring.h
edit: include/swift/IDE/Utils.h
edit: lib/IDE/SwiftSourceDocInfo.cpp
edit: tools/SourceKit/lib/SwiftLang/SwiftLangSupport.h
edit: docs/refactoring/SwiftLocalRefactoring.md
edit: unittests/SourceKit/SwiftLang/CursorInfoTest.cpp
edit: tools/SourceKit/lib/SwiftLang/SwiftSourceDocInfo.cpp
edit: tools/SourceKit/include/SourceKit/Core/LangSupport.h

New issue found!

Bot issue?

20:38:58 FATAL: command execution failed
20:38:58 java.io.EOFException
20:38:58 at java.io.ObjectInputStream$PeekInputStream.readFully(ObjectInputStream.java:2624)
20:38:58 at java.io.ObjectInputStream$BlockDataInputStream.readShort(ObjectInputStream.java:3099)
20:38:58 at java.io.ObjectInputStream.readStreamHeader(ObjectInputStream.java:853)
20:38:58 at java.io.ObjectInputStream.<init>(ObjectInputStream.java:349)
20:38:58 at hudson.remoting.ObjectInputStreamEx.<init>(ObjectInputStreamEx.java:48)
20:38:58 at hudson.remoting.AbstractSynchronousByteArrayCommandTransport.read(AbstractSynchronousByteArrayCommandTransport.java:34)
20:38:58 at hudson.remoting.SynchronousCommandTransport$ReaderThread.run(SynchronousCommandTransport.java:59)
20:38:58 Caused: java.io.IOException: Unexpected termination of the channel
20:38:58 at hudson.remoting.SynchronousCommandTransport$ReaderThread.run(SynchronousCommandTransport.java:73)
20:38:58 Caused: java.io.IOException: Backing channel 'macOS-01' is disconnected.
20:38:58 at hudson.remoting.RemoteInvocationHandler.channelOrFail(RemoteInvocationHandler.java:192)
20:38:58 at hudson.remoting.RemoteInvocationHandler.invoke(RemoteInvocationHandler.java:257)

···

On Aug 29, 2017, at 6:37 PM, no-reply@swift.org wrote:

New issue found!

[FAILURE] oss-swift-package-osx [#157]

Build URL: https://ci.swift.org/job/oss-swift-package-osx/157/
Project: oss-swift-package-osx
Date of build: Tue, 29 Aug 2017 20:01:44 -0500
Build duration: 37 min

Changes

Commit 10db94e31ee61e368b790f08398f817c17382a25 by mgottesman:
[silgen] When checking we check if a failable initializer that we

edit: test/SILGen/objc_thunks.swift
edit: lib/SILGen/SILGenExpr.cpp

Commit 9d5f28039ad7fdd9dd0b7afa8f7e78b54447fb1d by mgottesman:
[silgen] Update SILGen objc deallocators and enable ownership on

edit: test/SILGen/objc_dealloc.swift
edit: lib/SILGen/SILGenBuilder.h
edit: lib/SILGen/SILGenDestructor.cpp
edit: lib/SILGen/SILGenFunction.h
edit: lib/SILGen/SILGenBuilder.cpp

Commit 88f58015fb8843b82101ae093b8b0058fbbea570 by mgottesman:
[semantic-sil] Enable the ownership verifier on 8 more objc tests now

edit: test/SILGen/objc_bridged_generic_conformance.swift
edit: test/SILGen/objc_bridged_generic_nonnull.swift
edit: test/SILGen/objc_bridged_using_protocol_extension_impl.swift
edit: test/SILGen/objc_attr_NSManaged.swift
edit: test/SILGen/objc_blocks_bridging.swift
edit: test/SILGen/objc_attr_NSManaged_multi.swift
edit: test/SILGen/objc_bridging.swift
edit: test/SILGen/objc_bridged_results.swift

Commit f5a6ac96cb99693b1f82b4c2f1576770bff7c13d by github:
[test] Add a test for the tricky circularity in SR-5191. (#11685)

add: validation-test/Serialization/Inputs/SR5191-other.swift
add: validation-test/Serialization/SR5191.swift

Commit cf91ea073699a215ed52dc74d1e69049da6fa9f1 by vsk:
[llvm-cov] Allow specifying distinct architectures for each loaded

edit: include/llvm/ProfileData/Coverage/CoverageMapping.h
edit: test/tools/llvm-cov/universal-binary.c
edit: docs/CommandGuide/llvm-cov.rst
edit: lib/ProfileData/Coverage/CoverageMapping.cpp
edit: tools/llvm-cov/CodeCoverage.cpp

Commit 34063d42c018be634d3ebf6aad3b1263d0a4a9a1 by vsk:
[Coverage] Add an API to retrive all instantiations of a function (NFC)

edit: tools/llvm-cov/CoverageSummaryInfo.h
edit: tools/llvm-cov/CoverageSummaryInfo.cpp
edit: tools/llvm-cov/CodeCoverage.cpp
edit: include/llvm/ProfileData/Coverage/CoverageMapping.h
edit: lib/ProfileData/Coverage/CoverageMapping.cpp
edit: tools/llvm-cov/CoverageReport.cpp
edit: unittests/ProfileData/CoverageMappingTest.cpp

Commit 4046ede62fefd218ad369e64647bc55480fd0d27 by vsk:
Rely on autobrief, remove \briefs from a header. NFC.

edit: include/llvm/ProfileData/Coverage/CoverageMapping.h

Commit 0ad7f7df22734564337203c528c26dc40171b135 by vsk:
Move two functions to a nicer spot. NFC.

edit: include/llvm/ProfileData/Coverage/CoverageMapping.h

Commit 28d60c13d83dab23c3d1555e9c8b71392cb42e7c by vsk:
[ProfData] Detect if zlib is available

add: test/tools/llvm-profdata/nocompress.test
edit: lib/ProfileData/InstrProf.cpp
add: test/tools/llvm-profdata/Inputs/compressed.profraw
edit: include/llvm/ProfileData/InstrProf.h

Commit 3fda41eb712991b7f26a56a6cf45073c8eb9f65a by vsk:
Fix the bug when SampleProfileWriter writes out number of callsites.

edit: lib/ProfileData/SampleProfWriter.cpp
edit: test/tools/llvm-profdata/Inputs/sample-profile.proftext

Network issue.

Thanks,
Mishal Shah

···

On Aug 29, 2017, at 6:38 PM, Michael Ilseman <milseman@apple.com> wrote:

Bot issue?

20:38:58 FATAL: command execution failed
20:38:58 java.io.EOFException
20:38:58 at java.io.ObjectInputStream$PeekInputStream.readFully(ObjectInputStream.java:2624)
20:38:58 at java.io.ObjectInputStream$BlockDataInputStream.readShort(ObjectInputStream.java:3099)
20:38:58 at java.io.ObjectInputStream.readStreamHeader(ObjectInputStream.java:853)
20:38:58 at java.io.ObjectInputStream.<init>(ObjectInputStream.java:349)
20:38:58 at hudson.remoting.ObjectInputStreamEx.<init>(ObjectInputStreamEx.java:48)
20:38:58 at hudson.remoting.AbstractSynchronousByteArrayCommandTransport.read(AbstractSynchronousByteArrayCommandTransport.java:34)
20:38:58 at hudson.remoting.SynchronousCommandTransport$ReaderThread.run(SynchronousCommandTransport.java:59)
20:38:58 Caused: java.io.IOException: Unexpected termination of the channel
20:38:58 at hudson.remoting.SynchronousCommandTransport$ReaderThread.run(SynchronousCommandTransport.java:73)
20:38:58 Caused: java.io.IOException: Backing channel 'macOS-01' is disconnected.
20:38:58 at hudson.remoting.RemoteInvocationHandler.channelOrFail(RemoteInvocationHandler.java:192)
20:38:58 at hudson.remoting.RemoteInvocationHandler.invoke(RemoteInvocationHandler.java:257)

On Aug 29, 2017, at 6:37 PM, no-reply@swift.org <mailto:no-reply@swift.org> wrote:

New issue found!

[FAILURE] oss-swift-package-osx [#157]

Build URL: https://ci.swift.org/job/oss-swift-package-osx/157/
Project: oss-swift-package-osx
Date of build: Tue, 29 Aug 2017 20:01:44 -0500
Build duration: 37 min

Changes

Commit 10db94e31ee61e368b790f08398f817c17382a25 by mgottesman:
[silgen] When checking we check if a failable initializer that we

edit: test/SILGen/objc_thunks.swift
edit: lib/SILGen/SILGenExpr.cpp

Commit 9d5f28039ad7fdd9dd0b7afa8f7e78b54447fb1d by mgottesman:
[silgen] Update SILGen objc deallocators and enable ownership on

edit: test/SILGen/objc_dealloc.swift
edit: lib/SILGen/SILGenBuilder.h
edit: lib/SILGen/SILGenDestructor.cpp
edit: lib/SILGen/SILGenFunction.h
edit: lib/SILGen/SILGenBuilder.cpp

Commit 88f58015fb8843b82101ae093b8b0058fbbea570 by mgottesman:
[semantic-sil] Enable the ownership verifier on 8 more objc tests now

edit: test/SILGen/objc_bridged_generic_conformance.swift
edit: test/SILGen/objc_bridged_generic_nonnull.swift
edit: test/SILGen/objc_bridged_using_protocol_extension_impl.swift
edit: test/SILGen/objc_attr_NSManaged.swift
edit: test/SILGen/objc_blocks_bridging.swift
edit: test/SILGen/objc_attr_NSManaged_multi.swift
edit: test/SILGen/objc_bridging.swift
edit: test/SILGen/objc_bridged_results.swift

Commit f5a6ac96cb99693b1f82b4c2f1576770bff7c13d by github:
[test] Add a test for the tricky circularity in SR-5191. (#11685)

add: validation-test/Serialization/Inputs/SR5191-other.swift
add: validation-test/Serialization/SR5191.swift

Commit cf91ea073699a215ed52dc74d1e69049da6fa9f1 by vsk:
[llvm-cov] Allow specifying distinct architectures for each loaded

edit: include/llvm/ProfileData/Coverage/CoverageMapping.h
edit: test/tools/llvm-cov/universal-binary.c
edit: docs/CommandGuide/llvm-cov.rst
edit: lib/ProfileData/Coverage/CoverageMapping.cpp
edit: tools/llvm-cov/CodeCoverage.cpp

Commit 34063d42c018be634d3ebf6aad3b1263d0a4a9a1 by vsk:
[Coverage] Add an API to retrive all instantiations of a function (NFC)

edit: tools/llvm-cov/CoverageSummaryInfo.h
edit: tools/llvm-cov/CoverageSummaryInfo.cpp
edit: tools/llvm-cov/CodeCoverage.cpp
edit: include/llvm/ProfileData/Coverage/CoverageMapping.h
edit: lib/ProfileData/Coverage/CoverageMapping.cpp
edit: tools/llvm-cov/CoverageReport.cpp
edit: unittests/ProfileData/CoverageMappingTest.cpp

Commit 4046ede62fefd218ad369e64647bc55480fd0d27 by vsk:
Rely on autobrief, remove \briefs from a header. NFC.

edit: include/llvm/ProfileData/Coverage/CoverageMapping.h

Commit 0ad7f7df22734564337203c528c26dc40171b135 by vsk:
Move two functions to a nicer spot. NFC.

edit: include/llvm/ProfileData/Coverage/CoverageMapping.h

Commit 28d60c13d83dab23c3d1555e9c8b71392cb42e7c by vsk:
[ProfData] Detect if zlib is available

add: test/tools/llvm-profdata/nocompress.test
edit: lib/ProfileData/InstrProf.cpp
add: test/tools/llvm-profdata/Inputs/compressed.profraw
edit: include/llvm/ProfileData/InstrProf.h

Commit 3fda41eb712991b7f26a56a6cf45073c8eb9f65a by vsk:
Fix the bug when SampleProfileWriter writes out number of callsites.

edit: lib/ProfileData/SampleProfWriter.cpp
edit: test/tools/llvm-profdata/Inputs/sample-profile.proftext

New issue found!