[Swift CI] Build Still Failing: 1. OSS - Swift ASAN - OS X (master) #927

“No space left on device"

···

On Jan 11, 2018, at 6:36 AM, swift-ci@swift.org wrote:

New issue found!

[FAILURE] oss-swift-incremental-ASAN-RA-osx [#927]

Build URL: https://ci.swift.org/job/oss-swift-incremental-ASAN-RA-osx/927/
Project: oss-swift-incremental-ASAN-RA-osx
Date of build: Thu, 11 Jan 2018 05:05:45 -0600
Build duration: 3 hr 30 min
Identified problems:

Regression test failed: This build failed because a regression test in the test suite FAILed. Below is a list of all errors:
Indication 1 <https://ci.swift.org//job/oss-swift-incremental-ASAN-RA-osx/927/consoleFull#1055582040ba62d58e-7248-467b-91e0-c7508d5cf947>
Compile Error: This build failed because of a compile error. Below is a list of all errors in the build log:
Indication 1 <https://ci.swift.org//job/oss-swift-incremental-ASAN-RA-osx/927/consoleFull#2467090753122a513-f36a-4c87-8ed7-cbc36a1ec144>
Changes

Commit 2c86f918def205b9414d89ee7967360ef56fc88f by dgregor:
[Runtime] Add tests for demanling never-before-seen types to metadata.

edit: test/Runtime/demangleToMetadata.swift

Commit 35268902332dd3ac0b746f863c9517bc2a96c1cb by spestov:
TypeReconstruction: Fix reconstruction of InOutType

edit: test/IDE/reconstruct_type_from_mangled_name.swift
edit: lib/IDE/TypeReconstruction.cpp

Commit 759f4c3a2cb1531958465058849fabdb4e09e628 by dgregor:
[Runtime] Skip Objective-C type records when looking for types.

edit: test/Runtime/demangleToMetadataObjC.swift
edit: stdlib/public/runtime/MetadataLookup.cpp
edit: stdlib/public/runtime/ProtocolConformance.cpp

Mishal, macOS-10 is out of space and all jobs failed. Could you take a look?

···

On Jan 11, 2018, at 7:17 AM, Douglas Gregor <dgregor@apple.com> wrote:

“No space left on device"

On Jan 11, 2018, at 6:36 AM, swift-ci@swift.org <mailto:swift-ci@swift.org> wrote:

New issue found!

[FAILURE] oss-swift-incremental-ASAN-RA-osx [#927]

Build URL: https://ci.swift.org/job/oss-swift-incremental-ASAN-RA-osx/927/
Project: oss-swift-incremental-ASAN-RA-osx
Date of build: Thu, 11 Jan 2018 05:05:45 -0600
Build duration: 3 hr 30 min
Identified problems:

Regression test failed: This build failed because a regression test in the test suite FAILed. Below is a list of all errors:
Indication 1 <https://ci.swift.org//job/oss-swift-incremental-ASAN-RA-osx/927/consoleFull#1055582040ba62d58e-7248-467b-91e0-c7508d5cf947>
Compile Error: This build failed because of a compile error. Below is a list of all errors in the build log:
Indication 1 <https://ci.swift.org//job/oss-swift-incremental-ASAN-RA-osx/927/consoleFull#2467090753122a513-f36a-4c87-8ed7-cbc36a1ec144>
Changes

Commit 2c86f918def205b9414d89ee7967360ef56fc88f by dgregor:
[Runtime] Add tests for demanling never-before-seen types to metadata.

edit: test/Runtime/demangleToMetadata.swift

Commit 35268902332dd3ac0b746f863c9517bc2a96c1cb by spestov:
TypeReconstruction: Fix reconstruction of InOutType

edit: test/IDE/reconstruct_type_from_mangled_name.swift
edit: lib/IDE/TypeReconstruction.cpp

Commit 759f4c3a2cb1531958465058849fabdb4e09e628 by dgregor:
[Runtime] Skip Objective-C type records when looking for types.

edit: test/Runtime/demangleToMetadataObjC.swift
edit: stdlib/public/runtime/MetadataLookup.cpp
edit: stdlib/public/runtime/ProtocolConformance.cpp

Fixed, this was due to new jobs added to CI.

Thanks,
Mishal Shah

···

On Jan 11, 2018, at 11:02 AM, Ben Langmuir <blangmuir@apple.com> wrote:

Mishal, macOS-10 is out of space and all jobs failed. Could you take a look?

On Jan 11, 2018, at 7:17 AM, Douglas Gregor <dgregor@apple.com <mailto:dgregor@apple.com>> wrote:

“No space left on device"

On Jan 11, 2018, at 6:36 AM, swift-ci@swift.org <mailto:swift-ci@swift.org> wrote:

New issue found!

[FAILURE] oss-swift-incremental-ASAN-RA-osx [#927]

Build URL: https://ci.swift.org/job/oss-swift-incremental-ASAN-RA-osx/927/
Project: oss-swift-incremental-ASAN-RA-osx
Date of build: Thu, 11 Jan 2018 05:05:45 -0600
Build duration: 3 hr 30 min
Identified problems:

Regression test failed: This build failed because a regression test in the test suite FAILed. Below is a list of all errors:
Indication 1 <https://ci.swift.org//job/oss-swift-incremental-ASAN-RA-osx/927/consoleFull#1055582040ba62d58e-7248-467b-91e0-c7508d5cf947>
Compile Error: This build failed because of a compile error. Below is a list of all errors in the build log:
Indication 1 <https://ci.swift.org//job/oss-swift-incremental-ASAN-RA-osx/927/consoleFull#2467090753122a513-f36a-4c87-8ed7-cbc36a1ec144>
Changes

Commit 2c86f918def205b9414d89ee7967360ef56fc88f by dgregor:
[Runtime] Add tests for demanling never-before-seen types to metadata.

edit: test/Runtime/demangleToMetadata.swift

Commit 35268902332dd3ac0b746f863c9517bc2a96c1cb by spestov:
TypeReconstruction: Fix reconstruction of InOutType

edit: test/IDE/reconstruct_type_from_mangled_name.swift
edit: lib/IDE/TypeReconstruction.cpp

Commit 759f4c3a2cb1531958465058849fabdb4e09e628 by dgregor:
[Runtime] Skip Objective-C type records when looking for types.

edit: test/Runtime/demangleToMetadataObjC.swift
edit: stdlib/public/runtime/MetadataLookup.cpp
edit: stdlib/public/runtime/ProtocolConformance.cpp