[Swift CI] Build Still Failing: 0. OSS - Swift Incremental RA - Ubuntu 16.10 (master) #11


(Doug Coleman) #1

Flaky test code for popen()? I think we saw this before...

fatal error: 'try!' expression unexpectedly raised an error: POSIX.ShellError.popen(arguments: ["echo", "foo"], close error: Unknown error -1): file /home/buildnode/disk1/workspace/oss-swift-incremental-RA-linux-ubuntu-16_10/swift/stdlib/public/core/ErrorType.swift, line 182

···

On Oct 14, 2016, at 4:48 PM, no-reply@swift.org <mailto:no-reply@swift.org> wrote:

New issue found!

[FAILURE] oss-swift-incremental-RA-linux-ubuntu-16_10 [#11]

Build URL: https://ci.swift.org/job/oss-swift-incremental-RA-linux-ubuntu-16_10/11/
Project: oss-swift-incremental-RA-linux-ubuntu-16_10
Date of build: Fri, 14 Oct 2016 16:22:21 -0700
Build duration: 26 min
Identified problems:

Compile Error: This build failed because of a compile error. Below is a list of all errors in the build log:
Indication 1 <https://ci.swift.org//job/oss-swift-incremental-RA-linux-ubuntu-16_10/11/consoleFull#-1007744702ee1a197b-acac-4b17-83cf-a53b95139a76>
Tests:

Name: Swift(linux-x86_64)
Failed: 0 test(s), Passed: 8420 test(s), Total: 8420 test(s)
Name: Swift-Unit
Failed: 0 test(s), Passed: 298 test(s), Total: 298 test(s)

Changes

Commit 09cbffb3e4ed5c4ef8069d273e2d34309abcd2e4 by Mishal Shah:
Initialize CachedVFile with nullptr

edit: include/swift/Basic/SourceManager.h
edit: lib/Basic/SourceLoc.cpp


(Doug Coleman) #2

<rdar://problem/28411803> POSIX.popen() sometimes breaks the build

Looks like it’s still broken?

Doug

···

On Oct 14, 2016, at 5:17 PM, Doug Coleman <doug_coleman@apple.com> wrote:

Flaky test code for popen()? I think we saw this before...

fatal error: 'try!' expression unexpectedly raised an error: POSIX.ShellError.popen(arguments: ["echo", "foo"], close error: Unknown error -1): file /home/buildnode/disk1/workspace/oss-swift-incremental-RA-linux-ubuntu-16_10/swift/stdlib/public/core/ErrorType.swift, line 182

On Oct 14, 2016, at 4:48 PM, no-reply@swift.org <mailto:no-reply@swift.org> wrote:

New issue found!

[FAILURE] oss-swift-incremental-RA-linux-ubuntu-16_10 [#11]

Build URL: https://ci.swift.org/job/oss-swift-incremental-RA-linux-ubuntu-16_10/11/
Project: oss-swift-incremental-RA-linux-ubuntu-16_10
Date of build: Fri, 14 Oct 2016 16:22:21 -0700
Build duration: 26 min
Identified problems:

Compile Error: This build failed because of a compile error. Below is a list of all errors in the build log:
Indication 1 <https://ci.swift.org//job/oss-swift-incremental-RA-linux-ubuntu-16_10/11/consoleFull#-1007744702ee1a197b-acac-4b17-83cf-a53b95139a76>
Tests:

Name: Swift(linux-x86_64)
Failed: 0 test(s), Passed: 8420 test(s), Total: 8420 test(s)
Name: Swift-Unit
Failed: 0 test(s), Passed: 298 test(s), Total: 298 test(s)

Changes

Commit 09cbffb3e4ed5c4ef8069d273e2d34309abcd2e4 by Mishal Shah:
Initialize CachedVFile with nullptr

edit: include/swift/Basic/SourceManager.h
edit: lib/Basic/SourceLoc.cpp


(Daniel Dunbar) #3

Cloned off:
  <rdar://problem/28786679> POSIX.popen() sometimes breaks the build

- Daniel

···

On Oct 14, 2016, at 5:25 PM, Doug Coleman via swift-dev <swift-dev@swift.org> wrote:

<rdar://problem/28411803 <rdar://problem/28411803>> POSIX.popen() sometimes breaks the build

Looks like it’s still broken?

Doug

On Oct 14, 2016, at 5:17 PM, Doug Coleman <doug_coleman@apple.com <mailto:doug_coleman@apple.com>> wrote:

Flaky test code for popen()? I think we saw this before...

fatal error: 'try!' expression unexpectedly raised an error: POSIX.ShellError.popen(arguments: ["echo", "foo"], close error: Unknown error -1): file /home/buildnode/disk1/workspace/oss-swift-incremental-RA-linux-ubuntu-16_10/swift/stdlib/public/core/ErrorType.swift, line 182

On Oct 14, 2016, at 4:48 PM, no-reply@swift.org <mailto:no-reply@swift.org> wrote:

New issue found!

[FAILURE] oss-swift-incremental-RA-linux-ubuntu-16_10 [#11]

Build URL: https://ci.swift.org/job/oss-swift-incremental-RA-linux-ubuntu-16_10/11/
Project: oss-swift-incremental-RA-linux-ubuntu-16_10
Date of build: Fri, 14 Oct 2016 16:22:21 -0700
Build duration: 26 min
Identified problems:

Compile Error: This build failed because of a compile error. Below is a list of all errors in the build log:
Indication 1 <https://ci.swift.org//job/oss-swift-incremental-RA-linux-ubuntu-16_10/11/consoleFull#-1007744702ee1a197b-acac-4b17-83cf-a53b95139a76>
Tests:

Name: Swift(linux-x86_64)
Failed: 0 test(s), Passed: 8420 test(s), Total: 8420 test(s)
Name: Swift-Unit
Failed: 0 test(s), Passed: 298 test(s), Total: 298 test(s)

Changes

Commit 09cbffb3e4ed5c4ef8069d273e2d34309abcd2e4 by Mishal Shah:
Initialize CachedVFile with nullptr

edit: include/swift/Basic/SourceManager.h
edit: lib/Basic/SourceLoc.cpp

_______________________________________________
swift-dev mailing list
swift-dev@swift.org
https://lists.swift.org/mailman/listinfo/swift-dev