[Swift CI] Build Still Failing: 0. OSS - Swift Incremental RA - Ubuntu 15.10 (master) #7404


(Philippe Hausler) #1

Looks like we are now missing run loop naming updates for XCTest

···

Sent from my iPhone

On Aug 18, 2016, at 4:20 PM, no-reply@swift.org wrote:

New issue found!

[FAILURE] oss-swift-incremental-RA-linux-ubuntu-15_10 [#7404]

Build URL: https://ci.swift.org/job/oss-swift-incremental-RA-linux-ubuntu-15_10/7404/
Project: oss-swift-incremental-RA-linux-ubuntu-15_10
Date of build: Thu, 18 Aug 2016 16:14:22 -0700
Build duration: 5 min 44 sec
Identified problems:

Regression test failed: This build failed because a regression test in the test suite FAILed. Below is a list of all errors:
Indication 1
Compile Error: This build failed because of a compile error. Below is a list of all errors in the build log:
Indication 1
Tests:

Name: Swift(linux-x86_64)
Failed: 0 test(s), Passed: 8249 test(s), Total: 8249 test(s)
Name: Swift-Unit
Failed: 0 test(s), Passed: 230 test(s), Total: 230 test(s)

Changes

Commit b888b0b9ef95d9e1f3ec2eead9128e7766f3b2ef by phausler:
Correction for building with optional @escaping closure on the init of

edit: Foundation/NSData.swift


(Michael J LeHew Jr) #2

I'll check again -- I thought I got them all.

-Michael

···

On Aug 18, 2016, at 4:27 PM, Philippe Hausler <phausler@apple.com> wrote:

Looks like we are now missing run loop naming updates for XCTest

Sent from my iPhone

On Aug 18, 2016, at 4:20 PM, no-reply@swift.org <mailto:no-reply@swift.org> wrote:

New issue found!

[FAILURE] oss-swift-incremental-RA-linux-ubuntu-15_10 [#7404]

Build URL: https://ci.swift.org/job/oss-swift-incremental-RA-linux-ubuntu-15_10/7404/
Project: oss-swift-incremental-RA-linux-ubuntu-15_10
Date of build: Thu, 18 Aug 2016 16:14:22 -0700
Build duration: 5 min 44 sec
Identified problems:

Regression test failed: This build failed because a regression test in the test suite FAILed. Below is a list of all errors:
Indication 1 <https://ci.swift.org//job/oss-swift-incremental-RA-linux-ubuntu-15_10/7404/consoleFull#1077775732fca400bf-2f4a-462e-b517-e058d770b2d7>
Compile Error: This build failed because of a compile error. Below is a list of all errors in the build log:
Indication 1 <https://ci.swift.org//job/oss-swift-incremental-RA-linux-ubuntu-15_10/7404/consoleFull#1348552718ee1a197b-acac-4b17-83cf-a53b95139a76>
Tests:

Name: Swift(linux-x86_64)
Failed: 0 test(s), Passed: 8249 test(s), Total: 8249 test(s)
Name: Swift-Unit
Failed: 0 test(s), Passed: 230 test(s), Total: 230 test(s)

Changes

Commit b888b0b9ef95d9e1f3ec2eead9128e7766f3b2ef by phausler:
Correction for building with optional @escaping closure on the init of

edit: Foundation/NSData.swift


(Michael J LeHew Jr) #3

Never mind -- I see what happened -- fixing now.

-Michael

···

On Aug 18, 2016, at 4:27 PM, Philippe Hausler <phausler@apple.com> wrote:

Looks like we are now missing run loop naming updates for XCTest

Sent from my iPhone

On Aug 18, 2016, at 4:20 PM, no-reply@swift.org <mailto:no-reply@swift.org> wrote:

New issue found!

[FAILURE] oss-swift-incremental-RA-linux-ubuntu-15_10 [#7404]

Build URL: https://ci.swift.org/job/oss-swift-incremental-RA-linux-ubuntu-15_10/7404/
Project: oss-swift-incremental-RA-linux-ubuntu-15_10
Date of build: Thu, 18 Aug 2016 16:14:22 -0700
Build duration: 5 min 44 sec
Identified problems:

Regression test failed: This build failed because a regression test in the test suite FAILed. Below is a list of all errors:
Indication 1 <https://ci.swift.org//job/oss-swift-incremental-RA-linux-ubuntu-15_10/7404/consoleFull#1077775732fca400bf-2f4a-462e-b517-e058d770b2d7>
Compile Error: This build failed because of a compile error. Below is a list of all errors in the build log:
Indication 1 <https://ci.swift.org//job/oss-swift-incremental-RA-linux-ubuntu-15_10/7404/consoleFull#1348552718ee1a197b-acac-4b17-83cf-a53b95139a76>
Tests:

Name: Swift(linux-x86_64)
Failed: 0 test(s), Passed: 8249 test(s), Total: 8249 test(s)
Name: Swift-Unit
Failed: 0 test(s), Passed: 230 test(s), Total: 230 test(s)

Changes

Commit b888b0b9ef95d9e1f3ec2eead9128e7766f3b2ef by phausler:
Correction for building with optional @escaping closure on the init of

edit: Foundation/NSData.swift