[Swift CI] Build Still Failing: 0. OSS - Swift Incremental RA - Ubuntu 15.10 (master) #5934


(Michael Ilseman) #1

TestFoundation/TestNSString.swift:633: error: TestNSString.test_initializeWithFormat3 : XCTAssertEqual failed: ("en_GB value is 1000 (42.0)") is not equal to ("en_GB value is 1,000 (42.0)") -

···

On Jun 23, 2016, at 5:40 PM, no-reply@swift.org wrote:

New issue found!

[FAILURE] oss-swift-incremental-RA-linux-ubuntu-15_10 [#5934]

Build URL: https://ci.swift.org/job/oss-swift-incremental-RA-linux-ubuntu-15_10/5934/
Project: oss-swift-incremental-RA-linux-ubuntu-15_10
Date of build: Thu, 23 Jun 2016 17:32:22 -0700
Build duration: 8 min 31 sec
Identified problems:

Compile Error: This build failed because of a compile error. Below is a list of all errors in the build log:
Indication 1 <https://ci.swift.org//job/oss-swift-incremental-RA-linux-ubuntu-15_10/5934/consoleFull#2023549963ee1a197b-acac-4b17-83cf-a53b95139a76>
Tests:

Name: Swift
Failed: 0 test(s), Passed: 8023 test(s), Total: 8023 test(s)
Name: Swift-Unit
Failed: 0 test(s), Passed: 292 test(s), Total: 292 test(s)

Changes

Commit e9ad55b9d7da8676941d67d82e46886099aa91a1 by milseman:
[Core Graphics] Add test case for renamed APIs

add: test/ClangModules/CoreGraphics_test.swift

Commit d2c559d8a80404d623b26f028dd80de0b6bae8a9 by phausler:
Correct fallout from latest string refactoring in Foundation

edit: Sources/Utility/File.swift


(Philippe Hausler) #2

Yea got that one too, that passes on Darwin builds: it seems like a Linux bug in icu from what I can tell

···

Sent from my iPhone

On Jun 23, 2016, at 5:50 PM, Michael Ilseman <milseman@apple.com> wrote:

TestFoundation/TestNSString.swift:633: error: TestNSString.test_initializeWithFormat3 : XCTAssertEqual failed: ("en_GB value is 1000 (42.0)") is not equal to ("en_GB value is 1,000 (42.0)") -

On Jun 23, 2016, at 5:40 PM, no-reply@swift.org wrote:

New issue found!

[FAILURE] oss-swift-incremental-RA-linux-ubuntu-15_10 [#5934]

Build URL: https://ci.swift.org/job/oss-swift-incremental-RA-linux-ubuntu-15_10/5934/
Project: oss-swift-incremental-RA-linux-ubuntu-15_10
Date of build: Thu, 23 Jun 2016 17:32:22 -0700
Build duration: 8 min 31 sec
Identified problems:

Compile Error: This build failed because of a compile error. Below is a list of all errors in the build log:
Indication 1
Tests:

Name: Swift
Failed: 0 test(s), Passed: 8023 test(s), Total: 8023 test(s)
Name: Swift-Unit
Failed: 0 test(s), Passed: 292 test(s), Total: 292 test(s)

Changes

Commit e9ad55b9d7da8676941d67d82e46886099aa91a1 by milseman:
[Core Graphics] Add test case for renamed APIs

add: test/ClangModules/CoreGraphics_test.swift

Commit d2c559d8a80404d623b26f028dd80de0b6bae8a9 by phausler:
Correct fallout from latest string refactoring in Foundation

edit: Sources/Utility/File.swift