[Swift CI] Build Still Failing: 0. OSS - Swift Incremental RA - Ubuntu 15.10 - Long Test (master) #87


(Jordan Rose) #1

Dave, I think this really is you, even if it's something the compiler should accept. (I didn't look too closely.)

Jordan

···

On May 2, 2016, at 12:47, no-reply@swift.org wrote:

New issue found!

[FAILURE] oss-swift-incremental-RA-linux-ubuntu-15_10-long-test [#87]

Build URL: https://ci.swift.org/job/oss-swift-incremental-RA-linux-ubuntu-15_10-long-test/87/
Project: oss-swift-incremental-RA-linux-ubuntu-15_10-long-test
Date of build: Mon, 02 May 2016 12:38:00 -0700
Build duration: 9 min 17 sec
Identified problems:

Compile Error: This build failed because of a compile error. Below is a list of all errors in the build log:
Indication 1 <https://ci.swift.org//job/oss-swift-incremental-RA-linux-ubuntu-15_10-long-test/87/consoleFull#-183983806ee1a197b-acac-4b17-83cf-a53b95139a76>
Regression test failed: This build failed because a regression test in the test suite FAILed. Below is a list of all errors:
Indication 1 <https://ci.swift.org//job/oss-swift-incremental-RA-linux-ubuntu-15_10-long-test/87/consoleFull#341886736fca400bf-2f4a-462e-b517-e058d770b2d7>
Tests:

Name: Swift
Failed: 17 test(s), Passed: 7860 test(s), Total: 7877 test(s)
Failed: Swift.SIL.parse_stdlib_0.sil <https://ci.swift.org/job/oss-swift-incremental-RA-linux-ubuntu-15_10-long-test/87/testReport/junit/Swift/SIL/parse_stdlib_0_sil>
Failed: Swift.SIL.parse_stdlib_1.sil <https://ci.swift.org/job/oss-swift-incremental-RA-linux-ubuntu-15_10-long-test/87/testReport/junit/Swift/SIL/parse_stdlib_1_sil>
Failed: Swift.SIL.parse_stdlib_10.sil <https://ci.swift.org/job/oss-swift-incremental-RA-linux-ubuntu-15_10-long-test/87/testReport/junit/Swift/SIL/parse_stdlib_10_sil>
Failed: Swift.SIL.parse_stdlib_11.sil <https://ci.swift.org/job/oss-swift-incremental-RA-linux-ubuntu-15_10-long-test/87/testReport/junit/Swift/SIL/parse_stdlib_11_sil>
Failed: Swift.SIL.parse_stdlib_12.sil <https://ci.swift.org/job/oss-swift-incremental-RA-linux-ubuntu-15_10-long-test/87/testReport/junit/Swift/SIL/parse_stdlib_12_sil>
Failed: Swift.SIL.parse_stdlib_13.sil <https://ci.swift.org/job/oss-swift-incremental-RA-linux-ubuntu-15_10-long-test/87/testReport/junit/Swift/SIL/parse_stdlib_13_sil>
Failed: Swift.SIL.parse_stdlib_14.sil <https://ci.swift.org/job/oss-swift-incremental-RA-linux-ubuntu-15_10-long-test/87/testReport/junit/Swift/SIL/parse_stdlib_14_sil>
Failed: Swift.SIL.parse_stdlib_15.sil <https://ci.swift.org/job/oss-swift-incremental-RA-linux-ubuntu-15_10-long-test/87/testReport/junit/Swift/SIL/parse_stdlib_15_sil>
Failed: Swift.SIL.parse_stdlib_16.sil <https://ci.swift.org/job/oss-swift-incremental-RA-linux-ubuntu-15_10-long-test/87/testReport/junit/Swift/SIL/parse_stdlib_16_sil>
Failed: Swift.SIL.parse_stdlib_2.sil <https://ci.swift.org/job/oss-swift-incremental-RA-linux-ubuntu-15_10-long-test/87/testReport/junit/Swift/SIL/parse_stdlib_2_sil>
Failed: Swift.SIL.parse_stdlib_3.sil <https://ci.swift.org/job/oss-swift-incremental-RA-linux-ubuntu-15_10-long-test/87/testReport/junit/Swift/SIL/parse_stdlib_3_sil>
Failed: Swift.SIL.parse_stdlib_4.sil <https://ci.swift.org/job/oss-swift-incremental-RA-linux-ubuntu-15_10-long-test/87/testReport/junit/Swift/SIL/parse_stdlib_4_sil>
Failed: Swift.SIL.parse_stdlib_5.sil <https://ci.swift.org/job/oss-swift-incremental-RA-linux-ubuntu-15_10-long-test/87/testReport/junit/Swift/SIL/parse_stdlib_5_sil>
Failed: Swift.SIL.parse_stdlib_6.sil <https://ci.swift.org/job/oss-swift-incremental-RA-linux-ubuntu-15_10-long-test/87/testReport/junit/Swift/SIL/parse_stdlib_6_sil>
Failed: Swift.SIL.parse_stdlib_7.sil <https://ci.swift.org/job/oss-swift-incremental-RA-linux-ubuntu-15_10-long-test/87/testReport/junit/Swift/SIL/parse_stdlib_7_sil>
Failed: Swift.SIL.parse_stdlib_8.sil <https://ci.swift.org/job/oss-swift-incremental-RA-linux-ubuntu-15_10-long-test/87/testReport/junit/Swift/SIL/parse_stdlib_8_sil>
Failed: Swift.SIL.parse_stdlib_9.sil <https://ci.swift.org/job/oss-swift-incremental-RA-linux-ubuntu-15_10-long-test/87/testReport/junit/Swift/SIL/parse_stdlib_9_sil>
Name: Swift-Unit
Failed: 0 test(s), Passed: 291 test(s), Total: 291 test(s)

Changes

Commit c99f59e3e6dfb0e579206d577b427c93a5f6d62a by dabrahams:
[stdlib] Suppress some warnings

edit: stdlib/public/core/UnicodeScalar.swift
edit: stdlib/public/core/CocoaArray.swift
edit: stdlib/public/core/Mirror.swift

Commit 1e501ddd9f706c9acf5bd2f6fe387f983956d02f by moiseev:
[stdlib] copying fixed doc comments from Indexable to Collection

edit: stdlib/public/core/Collection.swift

Commit 7b8c4fca8e67eac7a48b02a916623a04345e682b by jordan_rose:
[test] Disable Reflection/typeref_decoding on non-OS-X.

edit: test/Reflection/typeref_decoding.swift

Commit 065af62293333cf1e8107f83a06c5453f603c684 by gribozavr:
CoreAudio overlay: remove a FIXME that is fixed

edit: stdlib/public/SDK/CoreAudio/CoreAudio.swift

Commit c594b1d331121c79307e6be650add7210146308b by gribozavr:
EmptyCollection: fixes for index movement and more tests

edit: validation-test/stdlib/Lazy.swift.gyb
edit: stdlib/public/core/EmptyCollection.swift

Commit 0d68b3a4af6f600486ea82787a90d203c07800ba by dabrahams:
[stdlib] Generate RandomAccessCollection defaults

edit: stdlib/public/core/RandomAccessCollection.swift
edit: stdlib/public/SDK/CoreAudio/CoreAudio.swift
edit: stdlib/public/core/BidirectionalCollection.swift
edit: stdlib/public/core/EmptyCollection.swift
edit: test/Constraints/recursive_concrete_constraints.swift
edit: validation-test/stdlib/CollectionDiagnostics.swift
edit: stdlib/public/core/ArrayBufferProtocol.swift
edit: validation-test/stdlib/Algorithm.swift
edit: stdlib/public/core/ContiguousArrayBuffer.swift
edit: stdlib/public/core/Arrays.swift.gyb
edit: stdlib/public/core/SliceBuffer.swift
edit: stdlib/public/core/CocoaArray.swift
edit: stdlib/public/core/Collection.swift
edit: stdlib/public/core/CollectionOfOne.swift
edit: stdlib/public/core/Repeat.swift
edit: stdlib/public/core/ArrayBuffer.swift
edit: stdlib/public/core/Character.swift
edit: stdlib/public/core/UnicodeScalar.swift
edit: validation-test/stdlib/Sort.swift.gyb
edit: stdlib/public/core/StringCore.swift
edit: stdlib/public/core/Mirror.swift
edit: validation-test/stdlib/Arrays.swift.gyb

Commit 3105ef9bf1d23d5130652a6f45746d038b8645c9 by dabrahams:
[stdlib] Fixing a duplicate declaration bug

edit: stdlib/public/core/EmptyCollection.swift

Commit bba0b220a74648fa71447a2d19915a9446459d30 by daniel:
Add missing swift build --clean shorthand "-k" & change 'artefact' to US

edit: Sources/swift-build/usage.swift


(Dave Abrahams) #2

Dave, I think this really is you, even if it's something the compiler should
accept. (I didn't look too closely.)

I don't know what to do about it, but I'm investigating.

···

on Mon May 02 2016, Jordan Rose <jordan_rose-AT-apple.com> wrote:

Jordan

    On May 2, 2016, at 12:47, no-reply@swift.org wrote:

    New issue found!

    [FAILURE] oss-swift-incremental-RA-linux-ubuntu-15_10-long-test [#87]

     Build URL: https://ci.swift.org/job/oss-swift-incremental-RA-linux-ubunt
                     u-15_10-long-test/87/
     Project: oss-swift-incremental-RA-linux-ubuntu-15_10-long-test
     Date of build: Mon, 02 May 2016 12:38:00 -0700
     Build duration: 9 min 17 sec

    Identified problems:

    * Compile Error: This build failed because of a compile error. Below is a
      list of all errors in the build log:

      * Indication 1

    * Regression test failed: This build failed because a regression test in the
      test suite FAILed. Below is a list of all errors:

      * Indication 1

    Tests:

     Name: Swift
     Failed: 17 test(s), Passed: 7860 test(s), Total: 7877 test(s)
     * Failed: Swift.SIL.parse_stdlib_0.sil
     * Failed: Swift.SIL.parse_stdlib_1.sil
     * Failed: Swift.SIL.parse_stdlib_10.sil
     * Failed: Swift.SIL.parse_stdlib_11.sil
     * Failed: Swift.SIL.parse_stdlib_12.sil
     * Failed: Swift.SIL.parse_stdlib_13.sil
     * Failed: Swift.SIL.parse_stdlib_14.sil
     * Failed: Swift.SIL.parse_stdlib_15.sil
     * Failed: Swift.SIL.parse_stdlib_16.sil
     * Failed: Swift.SIL.parse_stdlib_2.sil
     * Failed: Swift.SIL.parse_stdlib_3.sil
     * Failed: Swift.SIL.parse_stdlib_4.sil
     * Failed: Swift.SIL.parse_stdlib_5.sil
     * Failed: Swift.SIL.parse_stdlib_6.sil
     * Failed: Swift.SIL.parse_stdlib_7.sil
     * Failed: Swift.SIL.parse_stdlib_8.sil
     * Failed: Swift.SIL.parse_stdlib_9.sil

     Name: Swift-Unit
     Failed: 0 test(s), Passed: 291 test(s), Total: 291 test(s)

    Changes

    * Commit c99f59e3e6dfb0e579206d577b427c93a5f6d62a by dabrahams:

      [stdlib] Suppress some warnings

      * edit: stdlib/public/core/UnicodeScalar.swift
      * edit: stdlib/public/core/CocoaArray.swift
      * edit: stdlib/public/core/Mirror.swift

    * Commit 1e501ddd9f706c9acf5bd2f6fe387f983956d02f by moiseev:

      [stdlib] copying fixed doc comments from Indexable to Collection

      * edit: stdlib/public/core/Collection.swift

    * Commit 7b8c4fca8e67eac7a48b02a916623a04345e682b by jordan_rose:

      [test] Disable Reflection/typeref_decoding on non-OS-X.

      * edit: test/Reflection/typeref_decoding.swift

    * Commit 065af62293333cf1e8107f83a06c5453f603c684 by gribozavr:

      CoreAudio overlay: remove a FIXME that is fixed

      * edit: stdlib/public/SDK/CoreAudio/CoreAudio.swift

    * Commit c594b1d331121c79307e6be650add7210146308b by gribozavr:

      EmptyCollection: fixes for index movement and more tests

      * edit: validation-test/stdlib/Lazy.swift.gyb
      * edit: stdlib/public/core/EmptyCollection.swift

    * Commit 0d68b3a4af6f600486ea82787a90d203c07800ba by dabrahams:

      [stdlib] Generate RandomAccessCollection defaults

      * edit: stdlib/public/core/RandomAccessCollection.swift
      * edit: stdlib/public/SDK/CoreAudio/CoreAudio.swift
      * edit: stdlib/public/core/BidirectionalCollection.swift
      * edit: stdlib/public/core/EmptyCollection.swift
      * edit: test/Constraints/recursive_concrete_constraints.swift
      * edit: validation-test/stdlib/CollectionDiagnostics.swift
      * edit: stdlib/public/core/ArrayBufferProtocol.swift
      * edit: validation-test/stdlib/Algorithm.swift
      * edit: stdlib/public/core/ContiguousArrayBuffer.swift
      * edit: stdlib/public/core/Arrays.swift.gyb
      * edit: stdlib/public/core/SliceBuffer.swift
      * edit: stdlib/public/core/CocoaArray.swift
      * edit: stdlib/public/core/Collection.swift
      * edit: stdlib/public/core/CollectionOfOne.swift
      * edit: stdlib/public/core/Repeat.swift
      * edit: stdlib/public/core/ArrayBuffer.swift
      * edit: stdlib/public/core/Character.swift
      * edit: stdlib/public/core/UnicodeScalar.swift
      * edit: validation-test/stdlib/Sort.swift.gyb
      * edit: stdlib/public/core/StringCore.swift
      * edit: stdlib/public/core/Mirror.swift
      * edit: validation-test/stdlib/Arrays.swift.gyb

    * Commit 3105ef9bf1d23d5130652a6f45746d038b8645c9 by dabrahams:

      [stdlib] Fixing a duplicate declaration bug

      * edit: stdlib/public/core/EmptyCollection.swift

    * Commit bba0b220a74648fa71447a2d19915a9446459d30 by daniel:

      Add missing swift build --clean shorthand "-k" & change 'artefact' to US

      * edit: Sources/swift-build/usage.swift

--
Dave


(Dave Abrahams) #3

0e38795 should fix this (local testing confirms)

···

on Mon May 02 2016, Jordan Rose <jordan_rose-AT-apple.com> wrote:

Dave, I think this really is you, even if it's something the compiler should
accept. (I didn't look too closely.)

Jordan

    On May 2, 2016, at 12:47, no-reply@swift.org wrote:

    New issue found!

    [FAILURE] oss-swift-incremental-RA-linux-ubuntu-15_10-long-test [#87]

     Build URL: https://ci.swift.org/job/oss-swift-incremental-RA-linux-ubunt
                     u-15_10-long-test/87/
     Project: oss-swift-incremental-RA-linux-ubuntu-15_10-long-test
     Date of build: Mon, 02 May 2016 12:38:00 -0700
     Build duration: 9 min 17 sec

    Identified problems:

    * Compile Error: This build failed because of a compile error. Below is a
      list of all errors in the build log:

      * Indication 1

    * Regression test failed: This build failed because a regression test in the
      test suite FAILed. Below is a list of all errors:

      * Indication 1

    Tests:

     Name: Swift
     Failed: 17 test(s), Passed: 7860 test(s), Total: 7877 test(s)
     * Failed: Swift.SIL.parse_stdlib_0.sil
     * Failed: Swift.SIL.parse_stdlib_1.sil
     * Failed: Swift.SIL.parse_stdlib_10.sil
     * Failed: Swift.SIL.parse_stdlib_11.sil
     * Failed: Swift.SIL.parse_stdlib_12.sil
     * Failed: Swift.SIL.parse_stdlib_13.sil
     * Failed: Swift.SIL.parse_stdlib_14.sil
     * Failed: Swift.SIL.parse_stdlib_15.sil
     * Failed: Swift.SIL.parse_stdlib_16.sil
     * Failed: Swift.SIL.parse_stdlib_2.sil
     * Failed: Swift.SIL.parse_stdlib_3.sil
     * Failed: Swift.SIL.parse_stdlib_4.sil
     * Failed: Swift.SIL.parse_stdlib_5.sil
     * Failed: Swift.SIL.parse_stdlib_6.sil
     * Failed: Swift.SIL.parse_stdlib_7.sil
     * Failed: Swift.SIL.parse_stdlib_8.sil
     * Failed: Swift.SIL.parse_stdlib_9.sil

     Name: Swift-Unit
     Failed: 0 test(s), Passed: 291 test(s), Total: 291 test(s)

    Changes

    * Commit c99f59e3e6dfb0e579206d577b427c93a5f6d62a by dabrahams:

      [stdlib] Suppress some warnings

      * edit: stdlib/public/core/UnicodeScalar.swift
      * edit: stdlib/public/core/CocoaArray.swift
      * edit: stdlib/public/core/Mirror.swift

    * Commit 1e501ddd9f706c9acf5bd2f6fe387f983956d02f by moiseev:

      [stdlib] copying fixed doc comments from Indexable to Collection

      * edit: stdlib/public/core/Collection.swift

    * Commit 7b8c4fca8e67eac7a48b02a916623a04345e682b by jordan_rose:

      [test] Disable Reflection/typeref_decoding on non-OS-X.

      * edit: test/Reflection/typeref_decoding.swift

    * Commit 065af62293333cf1e8107f83a06c5453f603c684 by gribozavr:

      CoreAudio overlay: remove a FIXME that is fixed

      * edit: stdlib/public/SDK/CoreAudio/CoreAudio.swift

    * Commit c594b1d331121c79307e6be650add7210146308b by gribozavr:

      EmptyCollection: fixes for index movement and more tests

      * edit: validation-test/stdlib/Lazy.swift.gyb
      * edit: stdlib/public/core/EmptyCollection.swift

    * Commit 0d68b3a4af6f600486ea82787a90d203c07800ba by dabrahams:

      [stdlib] Generate RandomAccessCollection defaults

      * edit: stdlib/public/core/RandomAccessCollection.swift
      * edit: stdlib/public/SDK/CoreAudio/CoreAudio.swift
      * edit: stdlib/public/core/BidirectionalCollection.swift
      * edit: stdlib/public/core/EmptyCollection.swift
      * edit: test/Constraints/recursive_concrete_constraints.swift
      * edit: validation-test/stdlib/CollectionDiagnostics.swift
      * edit: stdlib/public/core/ArrayBufferProtocol.swift
      * edit: validation-test/stdlib/Algorithm.swift
      * edit: stdlib/public/core/ContiguousArrayBuffer.swift
      * edit: stdlib/public/core/Arrays.swift.gyb
      * edit: stdlib/public/core/SliceBuffer.swift
      * edit: stdlib/public/core/CocoaArray.swift
      * edit: stdlib/public/core/Collection.swift
      * edit: stdlib/public/core/CollectionOfOne.swift
      * edit: stdlib/public/core/Repeat.swift
      * edit: stdlib/public/core/ArrayBuffer.swift
      * edit: stdlib/public/core/Character.swift
      * edit: stdlib/public/core/UnicodeScalar.swift
      * edit: validation-test/stdlib/Sort.swift.gyb
      * edit: stdlib/public/core/StringCore.swift
      * edit: stdlib/public/core/Mirror.swift
      * edit: validation-test/stdlib/Arrays.swift.gyb

    * Commit 3105ef9bf1d23d5130652a6f45746d038b8645c9 by dabrahams:

      [stdlib] Fixing a duplicate declaration bug

      * edit: stdlib/public/core/EmptyCollection.swift

    * Commit bba0b220a74648fa71447a2d19915a9446459d30 by daniel:

      Add missing swift build --clean shorthand "-k" & change 'artefact' to US

      * edit: Sources/swift-build/usage.swift

--
Dave