[Swift CI] Build Still Failing: 0. OSS - Swift Incremental RA - Ubuntu 14.04 (master) #2723


(Joe Shajrawi) #1

FAIL: Swift(linux-x86_64) :: stdlib/ManagedBuffer.swift (6808 of 9856)
<>******************** TEST 'Swift(linux-x86_64) :: stdlib/ManagedBuffer.swift' FAILED ********************
Script:

I don’t see why this commit would cause… Any idea ?

Regards,
—Joe |  | :e-mail: shajrawi@apple.com <mailto:shajrawi@apple.com> | :iphone:(+1) 408-930-5203

···

On May 20, 2017, at 07:37, no-reply@swift.org <mailto:no-reply@swift.org> wrote:

New issue found!

[FAILURE] oss-swift-incremental-RA-linux-ubuntu-14_04 [#2723]

Build URL: https://ci.swift.org/job/oss-swift-incremental-RA-linux-ubuntu-14_04/2723/
Project: oss-swift-incremental-RA-linux-ubuntu-14_04
Date of build: Sat, 20 May 2017 07:00:26 -0700
Build duration: 37 min
Identified problems:

Regression test failed: This build failed because a regression test in the test suite FAILed. Below is a list of all errors:
Indication 1 <https://ci.swift.org//job/oss-swift-incremental-RA-linux-ubuntu-14_04/2723/consoleFull#2106670488fca400bf-2f4a-462e-b517-e058d770b2d7>
Changes

Commit 4fa73c582cf9d9bf9fa0c61a3670622c7476b0f6 by Ankit Aggarwal:
[bootstrap] Add -swift-version 3 for Xcode 8.3

edit: Utilities/bootstrap


(Roman Levenstein) #2

FAIL: Swift(linux-x86_64) :: stdlib/ManagedBuffer.swift (6808 of 9856)
******************** TEST 'Swift(linux-x86_64) :: stdlib/ManagedBuffer.swift' FAILED ********************
Script:

I don’t see why this commit would cause… Any idea ?

It says that it is still failing. It is actually failing since yesterday as far as I can see.

It seems to be the same bug that seems to pop up after
my "always inline" PR and only on Ubuntu 14.04.
- Roman

···

On May 20, 2017, at 19:40, Joe Shajrawi via swift-dev <swift-dev@swift.org> wrote:

Regards,
—Joe |  | :e-mail: shajrawi@apple.com | :iphone:(+1) 408-930-5203

On May 20, 2017, at 07:37, no-reply@swift.org wrote:

New issue found!

[FAILURE] oss-swift-incremental-RA-linux-ubuntu-14_04 [#2723]

Build URL: https://ci.swift.org/job/oss-swift-incremental-RA-linux-ubuntu-14_04/2723/
Project: oss-swift-incremental-RA-linux-ubuntu-14_04
Date of build: Sat, 20 May 2017 07:00:26 -0700
Build duration: 37 min
Identified problems:

Regression test failed: This build failed because a regression test in the test suite FAILed. Below is a list of all errors:
Indication 1

Changes

Commit 4fa73c582cf9d9bf9fa0c61a3670622c7476b0f6 by Ankit Aggarwal:
[bootstrap] Add -swift-version 3 for Xcode 8.3

edit: Utilities/bootstrap

_______________________________________________
swift-dev mailing list
swift-dev@swift.org
https://lists.swift.org/mailman/listinfo/swift-dev