[Swift CI] Build Still Failing: 0. OSS - LLDB Incremental - Ubuntu 16.04 (master) #2218


(Andrew Trick) #1

File "/home/buildnode/disk2/workspace/oss-lldb-incremental-linux-ubuntu-16_04/lldb/packages/Python/lldbsuite/test/python_api/watchpoint/condition/TestWatchpointConditionAPI.py", line 99, in test_watchpoint_cond_api
    self.assertTrue(thread, "The thread stopped due to watchpoint")
AssertionError: None is not True : The thread stopped due to watchpoint

No idea what this is. The report does not list any lldb commits.
-Andy

···

On Apr 14, 2017, at 8:47 PM, no-reply@swift.org wrote:

New issue found!

[FAILURE] oss-lldb-incremental-linux-ubuntu-16_04 [#2218]

Build URL: https://ci.swift.org/job/oss-lldb-incremental-linux-ubuntu-16_04/2218/
Project: oss-lldb-incremental-linux-ubuntu-16_04
Date of build: Fri, 14 Apr 2017 19:25:18 -0700
Build duration: 1 hr 22 min
Identified problems:

Regression test failed: This build failed because a regression test in the test suite FAILed. Below is a list of all errors:
Indication 1 <https://ci.swift.org//job/oss-lldb-incremental-linux-ubuntu-16_04/2218/consoleFull#-412742262fca400bf-2f4a-462e-b517-e058d770b2d7>
Tests:

Name: Test-rdar-12481949
Failed: 0 test(s), Passed: 3 test(s), Total: 3 test(s)
Name: Test-rdar-9974002
Failed: 0 test(s), Passed: 3 test(s), Total: 3 test(s)
Name: Test11588
Failed: 0 test(s), Passed: 3 test(s), Total: 3 test(s)
Name: Test8638051
Failed: 0 test(s), Passed: 3 test(s), Total: 3 test(s)
Name: TestAbbreviations
Failed: 0 test(s), Passed: 1 test(s), Total: 1 test(s)
Name: TestAddressBreakpoints
Failed: 0 test(s), Passed: 1 test(s), Total: 1 test(s)
Name: TestAnonymous
Failed: 0 test(s), Passed: 21 test(s), Total: 21 test(s)
Name: TestApropos
Failed: 0 test(s), Passed: 1 test(s), Total: 1 test(s)
Name: TestAproposWithProcess
Failed: 0 test(s), Passed: 3 test(s), Total: 3 test(s)
Name: TestArrayTypes
Failed: 0 test(s), Passed: 6 test(s), Total: 6 test(s)
Name: TestAsanSwift
Failed: 0 test(s), Passed: 0 test(s), Total: 3 test(s)
Name: TestAttachDenied
Failed: 0 test(s), Passed: 3 test(s), Total: 3 test(s)
Name: TestAttachResume
Failed: 0 test(s), Passed: 3 test(s), Total: 3 test(s)
Name: TestAvoidBreakpointInDelaySlot
Failed: 0 test(s), Passed: 0 test(s), Total: 3 test(s)
Name: TestBSDArchives
Failed: 0 test(s), Passed: 3 test(s), Total: 3 test(s)
Name: TestBackticksWithoutATarget
Failed: 0 test(s), Passed: 1 test(s), Total: 1 test(s)
Name: TestBacktraceAll
Failed: 0 test(s), Passed: 3 test(s), Total: 3 test(s)
Name: TestBadAddressBreakpoints
Failed: 0 test(s), Passed: 1 test(s), Total: 1 test(s)
Name: TestBatchMode
Failed: 0 test(s), Passed: 9 test(s), Total: 9 test(s)
Name: TestBitfields
Failed: 0 test(s), Passed: 6 test(s), Total: 6 test(s)
Name: TestBoundViolation
Failed: 0 test(s), Passed: 0 test(s), Total: 3 test(s)
Name: TestBreakAfterJoin
Failed: 0 test(s), Passed: 3 test(s), Total: 3 test(s)
Name: TestBreakpointAPI
Failed: 0 test(s), Passed: 3 test(s), Total: 3 test(s)
Name: TestBreakpointCaseSensitivity
Failed: 0 test(s), Passed: 3 test(s), Total: 6 test(s)
Name: TestBreakpointCommand
Failed: 0 test(s), Passed: 3 test(s), Total: 3 test(s)
Name: TestBreakpointCommandsFromPython
Failed: 0 test(s), Passed: 3 test(s), Total: 3 test(s)
Name: TestBreakpointConditions
Failed: 0 test(s), Passed: 12 test(s), Total: 12 test(s)
Name: TestBreakpointIDs
Failed: 0 test(s), Passed: 3 test(s), Total: 3 test(s)
Name: TestBreakpointIgnoreCount
Failed: 0 test(s), Passed: 6 test(s), Total: 6 test(s)
Name: TestBreakpointLanguage
Failed: 0 test(s), Passed: 6 test(s), Total: 6 test(s)
Name: TestBreakpointLocations
Failed: 0 test(s), Passed: 3 test(s), Total: 3 test(s)
Name: TestBreakpointNames
Failed: 0 test(s), Passed: 9 test(s), Total: 9 test(s)
Name: TestBreakpointOptions
Failed: 0 test(s), Passed: 3 test(s), Total: 3 test(s)
Name: TestBreakpointSerialization
Failed: 0 test(s), Passed: 15 test(s), Total: 15 test(s)
Name: TestBreakpointSetRestart
Failed: 0 test(s), Passed: 3 test(s), Total: 3 test(s)
Name: TestBreakpointsWithNoTargets
Failed: 0 test(s), Passed: 3 test(s), Total: 3 test(s)
Name: TestBuiltinTrap
Failed: 0 test(s), Passed: 3 test(s), Total: 3 test(s)
Name: TestBulkyEnumsVariables
Failed: 0 test(s), Passed: 3 test(s), Total: 3 test(s)
Name: TestCInlines
Failed: 0 test(s), Passed: 3 test(s), Total: 3 test(s)
Name: TestCModules
Failed: 0 test(s), Passed: 3 test(s), Total: 3 test(s)
Name: TestCPP11EnumTypes
Failed: 0 test(s), Passed: 24 test(s), Total: 24 test(s)
Name: TestCPPAuto
Failed: 0 test(s), Passed: 3 test(s), Total: 3 test(s)
Name: TestCPPBool
Failed: 0 test(s), Passed: 3 test(s), Total: 3 test(s)
Name: TestCPPBreakpointCommands
Failed: 0 test(s), Passed: 3 test(s), Total: 3 test(s)
Name: TestCPPBreakpointLocations
Failed: 0 test(s), Passed: 6 test(s), Total: 6 test(s)
Name: TestCPPExceptionBreakpoint
Failed: 0 test(s), Passed: 3 test(s), Total: 3 test(s)
Name: TestCPPExceptionBreakpoints
Failed: 0 test(s), Passed: 3 test(s), Total: 3 test(s)
Name: TestCPPStaticMembers
Failed: 0 test(s), Passed: 3 test(s), Total: 3 test(s)
Name: TestCPPStaticMethods
Failed: 0 test(s), Passed: 3 test(s), Total: 3 test(s)
Name: TestCPPThis
Failed: 0 test(s), Passed: 3 test(s), Total: 3 test(s)
Name: TestCStrings
Failed: 0 test(s), Passed: 3 test(s), Total: 3 test(s)
Name: TestCalculatorMode
Failed: 0 test(s), Passed: 3 test(s), Total: 3 test(s)
Name: TestCallCPPFunction
Failed: 0 test(s), Passed: 3 test(s), Total: 3 test(s)
Name: TestCallStdStringFunction
Failed: 0 test(s), Passed: 3 test(s), Total: 3 test(s)
Name: TestCallStopAndContinue
Failed: 0 test(s), Passed: 3 test(s), Total: 3 test(s)
Name: TestCallThatRestarts
Failed: 0 test(s), Passed: 3 test(s), Total: 3 test(s)
Name: TestCallUserAnonTypedef
Failed: 0 test(s), Passed: 3 test(s), Total: 3 test(s)
Name: TestCallUserDefinedFunction
Failed: 0 test(s), Passed: 3 test(s), Total: 3 test(s)
Name: TestCallWithTimeout
Failed: 0 test(s), Passed: 3 test(s), Total: 3 test(s)
Name: TestChangeProcessGroup
Failed: 0 test(s), Passed: 1 test(s), Total: 1 test(s)
Name: TestChangeValueAPI
Failed: 0 test(s), Passed: 3 test(s), Total: 3 test(s)
Name: TestChar1632T
Failed: 0 test(s), Passed: 3 test(s), Total: 3 test(s)
Name: TestClassTypes
Failed: 0 test(s), Passed: 12 test(s), Total: 12 test(s)
Name: TestClassTypesDisassembly
Failed: 0 test(s), Passed: 6 test(s), Total: 6 test(s)
Name: TestCommandHistory
Failed: 0 test(s), Passed: 1 test(s), Total: 1 test(s)
Name: TestCommandInterpreterAPI
Failed: 0 test(s), Passed: 3 test(s), Total: 3 test(s)
Name: TestCommandRegex
Failed: 0 test(s), Passed: 1 test(s), Total: 1 test(s)
Name: TestCommandScript
Failed: 0 test(s), Passed: 3 test(s), Total: 3 test(s)
Name: TestCommandScriptAlias
Failed: 0 test(s), Passed: 3 test(s), Total: 3 test(s)
Name: TestCommandScriptImmediateOutput
Failed: 0 test(s), Passed: 2 test(s), Total: 2 test(s)
Name: TestCommandSource
Failed: 0 test(s), Passed: 1 test(s), Total: 1 test(s)
Name: TestCommonShortSpellings
Failed: 0 test(s), Passed: 1 test(s), Total: 1 test(s)
Name: TestCompDirSymLink
Failed: 0 test(s), Passed: 9 test(s), Total: 9 test(s)
Name: TestCompletion
Failed: 0 test(s), Passed: 34 test(s), Total: 34 test(s)
Name: TestConcurrentBreakpointDelayBreakpointOneSignal
Failed: 0 test(s), Passed: 1 test(s), Total: 1 test(s)
Name: TestConcurrentBreakpointOneDelayBreakpointThreads
Failed: 0 test(s), Passed: 1 test(s), Total: 1 test(s)
Name: TestConcurrentBreakpointsDelayedBreakpointOneWatchpoint
Failed: 1 test(s), Passed: 0 test(s), Total: 1 test(s)
Failed: TestConcurrentBreakpointsDelayedBreakpointOneWatchpoint.ConcurrentBreakpointsDelayedBreakpointOneWatchpoint.test <https://ci.swift.org/job/oss-lldb-incremental-linux-ubuntu-16_04/2218/testReport/junit/TestConcurrentBreakpointsDelayedBreakpointOneWatchpoint/ConcurrentBreakpointsDelayedBreakpointOneWatchpoint/test>
Name: TestConcurrentCrashWithBreak
Failed: 0 test(s), Passed: 1 test(s), Total: 1 test(s)
Name: TestConcurrentCrashWithSignal
Failed: 0 test(s), Passed: 1 test(s), Total: 1 test(s)
Name: TestConcurrentCrashWithWatchpoint
Failed: 0 test(s), Passed: 1 test(s), Total: 1 test(s)
Name: TestConcurrentCrashWithWatchpointBreakpointSignal
Failed: 1 test(s), Passed: 0 test(s), Total: 1 test(s)
Failed: TestConcurrentCrashWithWatchpointBreakpointSignal.ConcurrentCrashWithWatchpointBreakpointSignal.test <https://ci.swift.org/job/oss-lldb-incremental-linux-ubuntu-16_04/2218/testReport/junit/TestConcurrentCrashWithWatchpointBreakpointSignal/ConcurrentCrashWithWatchpointBreakpointSignal/test>
Name: TestConcurrentDelaySignalBreak
Failed: 0 test(s), Passed: 1 test(s), Total: 1 test(s)
Name: TestConcurrentDelaySignalWatch
Failed: 1 test(s), Passed: 0 test(s), Total: 1 test(s)
Failed: TestConcurrentDelaySignalWatch.ConcurrentDelaySignalWatch.test <https://ci.swift.org/job/oss-lldb-incremental-linux-ubuntu-16_04/2218/testReport/junit/TestConcurrentDelaySignalWatch/ConcurrentDelaySignalWatch/test>
Name: TestConcurrentDelayWatchBreak
Failed: 1 test(s), Passed: 0 test(s), Total: 1 test(s)
Failed: TestConcurrentDelayWatchBreak.ConcurrentDelayWatchBreak.test <https://ci.swift.org/job/oss-lldb-incremental-linux-ubuntu-16_04/2218/testReport/junit/TestConcurrentDelayWatchBreak/ConcurrentDelayWatchBreak/test>
Name: TestConcurrentDelayedCrashWithBreakpointSignal
Failed: 0 test(s), Passed: 1 test(s), Total: 1 test(s)
Name: TestConcurrentDelayedCrashWithBreakpointWatchpoint
Failed: 1 test(s), Passed: 0 test(s), Total: 1 test(s)
Failed: TestConcurrentDelayedCrashWithBreakpointWatchpoint.ConcurrentDelayedCrashWithBreakpointWatchpoint.test <https://ci.swift.org/job/oss-lldb-incremental-linux-ubuntu-16_04/2218/testReport/junit/TestConcurrentDelayedCrashWithBreakpointWatchpoint/ConcurrentDelayedCrashWithBreakpointWatchpoint/test>
Name: TestConcurrentNWatchNBreak
Failed: 1 test(s), Passed: 0 test(s), Total: 1 test(s)
Failed: TestConcurrentNWatchNBreak.ConcurrentNWatchNBreak.test <https://ci.swift.org/job/oss-lldb-incremental-linux-ubuntu-16_04/2218/testReport/junit/TestConcurrentNWatchNBreak/ConcurrentNWatchNBreak/test>
Name: TestConcurrentSignalBreak
Failed: 0 test(s), Passed: 1 test(s), Total: 1 test(s)
Name: TestConcurrentSignalDelayBreak
Failed: 0 test(s), Passed: 1 test(s), Total: 1 test(s)
Name: TestConcurrentSignalDelayWatch
Failed: 1 test(s), Passed: 0 test(s), Total: 1 test(s)
Failed: TestConcurrentSignalDelayWatch.ConcurrentSignalDelayWatch.test <https://ci.swift.org/job/oss-lldb-incremental-linux-ubuntu-16_04/2218/testReport/junit/TestConcurrentSignalDelayWatch/ConcurrentSignalDelayWatch/test>
Name: TestConcurrentSignalNWatchNBreak
Failed: 1 test(s), Passed: 0 test(s), Total: 1 test(s)
Failed: TestConcurrentSignalNWatchNBreak.ConcurrentSignalNWatchNBreak.test <https://ci.swift.org/job/oss-lldb-incremental-linux-ubuntu-16_04/2218/testReport/junit/TestConcurrentSignalNWatchNBreak/ConcurrentSignalNWatchNBreak/test>
Name: TestConcurrentSignalWatch
Failed: 1 test(s), Passed: 0 test(s), Total: 1 test(s)
Failed: TestConcurrentSignalWatch.ConcurrentSignalWatch.test <https://ci.swift.org/job/oss-lldb-incremental-linux-ubuntu-16_04/2218/testReport/junit/TestConcurrentSignalWatch/ConcurrentSignalWatch/test>
Name: TestConcurrentSignalWatchBreak
Failed: 1 test(s), Passed: 0 test(s), Total: 1 test(s)
Failed: TestConcurrentSignalWatchBreak.ConcurrentSignalWatchBreak.test <https://ci.swift.org/job/oss-lldb-incremental-linux-ubuntu-16_04/2218/testReport/junit/TestConcurrentSignalWatchBreak/ConcurrentSignalWatchBreak/test>
Name: TestConcurrentTwoBreakpointThreads
Failed: 0 test(s), Passed: 1 test(s), Total: 1 test(s)
Name: TestConcurrentTwoBreakpointsOneDelaySignal
Failed: 0 test(s), Passed: 1 test(s), Total: 1 test(s)
Name: TestConcurrentTwoBreakpointsOneSignal
Failed: 0 test(s), Passed: 1 test(s), Total: 1 test(s)
Name: TestConcurrentTwoBreakpointsOneWatchpoint
Failed: 1 test(s), Passed: 0 test(s), Total: 1 test(s)
Failed: TestConcurrentTwoBreakpointsOneWatchpoint.ConcurrentTwoBreakpointsOneWatchpoint.test <https://ci.swift.org/job/oss-lldb-incremental-linux-ubuntu-16_04/2218/testReport/junit/TestConcurrentTwoBreakpointsOneWatchpoint/ConcurrentTwoBreakpointsOneWatchpoint/test>
Name: TestConcurrentTwoWatchpointThreads
Failed: 1 test(s), Passed: 0 test(s), Total: 1 test(s)
Failed: TestConcurrentTwoWatchpointThreads.ConcurrentTwoWatchpointThreads.test <https://ci.swift.org/job/oss-lldb-incremental-linux-ubuntu-16_04/2218/testReport/junit/TestConcurrentTwoWatchpointThreads/ConcurrentTwoWatchpointThreads/test>
Name: TestConcurrentTwoWatchpointsOneBreakpoint
Failed: 1 test(s), Passed: 0 test(s), Total: 1 test(s)
Failed: TestConcurrentTwoWatchpointsOneBreakpoint.ConcurrentTwoWatchpointsOneBreakpoint.test <https://ci.swift.org/job/oss-lldb-incremental-linux-ubuntu-16_04/2218/testReport/junit/TestConcurrentTwoWatchpointsOneBreakpoint/ConcurrentTwoWatchpointsOneBreakpoint/test>
Name: TestConcurrentTwoWatchpointsOneDelayBreakpoint
Failed: 1 test(s), Passed: 0 test(s), Total: 1 test(s)
Failed: TestConcurrentTwoWatchpointsOneDelayBreakpoint.ConcurrentTwoWatchpointsOneDelayBreakpoint.test <https://ci.swift.org/job/oss-lldb-incremental-linux-ubuntu-16_04/2218/testReport/junit/TestConcurrentTwoWatchpointsOneDelayBreakpoint/ConcurrentTwoWatchpointsOneDelayBreakpoint/test>
Name: TestConcurrentTwoWatchpointsOneSignal
Failed: 1 test(s), Passed: 0 test(s), Total: 1 test(s)
Failed: TestConcurrentTwoWatchpointsOneSignal.ConcurrentTwoWatchpointsOneSignal.test <https://ci.swift.org/job/oss-lldb-incremental-linux-ubuntu-16_04/2218/testReport/junit/TestConcurrentTwoWatchpointsOneSignal/ConcurrentTwoWatchpointsOneSignal/test>
Name: TestConcurrentWatchBreak
Failed: 1 test(s), Passed: 0 test(s), Total: 1 test(s)
Failed: TestConcurrentWatchBreak.ConcurrentWatchBreak.test <https://ci.swift.org/job/oss-lldb-incremental-linux-ubuntu-16_04/2218/testReport/junit/TestConcurrentWatchBreak/ConcurrentWatchBreak/test>
Name: TestConcurrentWatchBreakDelay
Failed: 1 test(s), Passed: 0 test(s), Total: 1 test(s)
Failed: TestConcurrentWatchBreakDelay.ConcurrentWatchBreakDelay.test <https://ci.swift.org/job/oss-lldb-incremental-linux-ubuntu-16_04/2218/testReport/junit/TestConcurrentWatchBreakDelay/ConcurrentWatchBreakDelay/test>
Name: TestConcurrentWatchpointDelayWatchpointOneBreakpoint
Failed: 1 test(s), Passed: 0 test(s), Total: 1 test(s)
Failed: TestConcurrentWatchpointDelayWatchpointOneBreakpoint.ConcurrentWatchpointDelayWatchpointOneBreakpoint.test <https://ci.swift.org/job/oss-lldb-incremental-linux-ubuntu-16_04/2218/testReport/junit/TestConcurrentWatchpointDelayWatchpointOneBreakpoint/ConcurrentWatchpointDelayWatchpointOneBreakpoint/test>
Name: TestConcurrentWatchpointWithDelayWatchpointThreads
Failed: 1 test(s), Passed: 0 test(s), Total: 1 test(s)
Failed: TestConcurrentWatchpointWithDelayWatchpointThreads.ConcurrentWatchpointWithDelayWatchpointThreads.test <https://ci.swift.org/job/oss-lldb-incremental-linux-ubuntu-16_04/2218/testReport/junit/TestConcurrentWatchpointWithDelayWatchpointThreads/ConcurrentWatchpointWithDelayWatchpointThreads/test>
Name: TestConditionalBreak
Failed: 0 test(s), Passed: 6 test(s), Total: 6 test(s)
Name: TestConsecutiveBreakpoints
Failed: 0 test(s), Passed: 3 test(s), Total: 3 test(s)
Name: TestConstVariables
Failed: 0 test(s), Passed: 3 test(s), Total: 3 test(s)
Name: TestConvenienceVariables
Failed: 0 test(s), Passed: 3 test(s), Total: 3 test(s)
Name: TestCppChainedCalls
Failed: 0 test(s), Passed: 3 test(s), Total: 3 test(s)
Name: TestCppGlobalOperators
Failed: 0 test(s), Passed: 6 test(s), Total: 6 test(s)
Name: TestCppIncompleteTypes
Failed: 0 test(s), Passed: 6 test(s), Total: 6 test(s)
Name: TestCppNsImport
Failed: 0 test(s), Passed: 3 test(s), Total: 3 test(s)
Name: TestCppScope
Failed: 0 test(s), Passed: 6 test(s), Total: 6 test(s)
Name: TestCppValueCast
Failed: 0 test(s), Passed: 6 test(s), Total: 6 test(s)
Name: TestCrashDuringStep
Failed: 0 test(s), Passed: 3 test(s), Total: 3 test(s)
Name: TestCreateAfterAttach
Failed: 0 test(s), Passed: 6 test(s), Total: 6 test(s)
Name: TestCreateDuringInstructionStep
Failed: 0 test(s), Passed: 3 test(s), Total: 3 test(s)
Name: TestCreateDuringStep
Failed: 0 test(s), Passed: 9 test(s), Total: 9 test(s)
Name: TestCxxWCharT
Failed: 0 test(s), Passed: 3 test(s), Total: 3 test(s)
Name: TestDarwinLogBasic
Failed: 0 test(s), Passed: 0 test(s), Total: 1 test(s)
Name: TestDarwinLogFilterMatchActivity
Failed: 0 test(s), Passed: 0 test(s), Total: 4 test(s)
Name: TestDarwinLogFilterMatchActivityChain
Failed: 0 test(s), Passed: 0 test(s), Total: 4 test(s)
Name: TestDarwinLogFilterMatchCategory
Failed: 0 test(s), Passed: 0 test(s), Total: 4 test(s)
Name: TestDarwinLogFilterMatchMessage
Failed: 0 test(s), Passed: 0 test(s), Total: 4 test(s)
Name: TestDarwinLogFilterMatchSubsystem
Failed: 0 test(s), Passed: 0 test(s), Total: 4 test(s)
Name: TestDarwinLogFilterRegexActivity
Failed: 0 test(s), Passed: 0 test(s), Total: 5 test(s)
Name: TestDarwinLogFilterRegexActivityChain
Failed: 0 test(s), Passed: 0 test(s), Total: 5 test(s)
Name: TestDarwinLogFilterRegexCategory
Failed: 0 test(s), Passed: 0 test(s), Total: 5 test(s)
Name: TestDarwinLogFilterRegexMessage
Failed: 0 test(s), Passed: 0 test(s), Total: 5 test(s)
Name: TestDarwinLogFilterRegexSubsystem
Failed: 0 test(s), Passed: 0 test(s), Total: 6 test(s)
Name: TestDarwinLogMessageFormat
Failed: 0 test(s), Passed: 0 test(s), Total: 6 test(s)
Name: TestDarwinLogSourceDebug
Failed: 0 test(s), Passed: 0 test(s), Total: 2 test(s)
Name: TestDarwinLogSourceInfo
Failed: 0 test(s), Passed: 0 test(s), Total: 2 test(s)
Name: TestDataFormatterAdv
Failed: 0 test(s), Passed: 3 test(s), Total: 3 test(s)
Name: TestDataFormatterCategories
Failed: 0 test(s), Passed: 3 test(s), Total: 3 test(s)
Name: TestDataFormatterCpp
Failed: 0 test(s), Passed: 3 test(s), Total: 3 test(s)
Name: TestDataFormatterDisabling
Failed: 0 test(s), Passed: 3 test(s), Total: 3 test(s)
Name: TestDataFormatterEnumFormat
Failed: 0 test(s), Passed: 3 test(s), Total: 3 test(s)
Name: TestDataFormatterGlobals
Failed: 0 test(s), Passed: 3 test(s), Total: 3 test(s)
Name: TestDataFormatterHexCaps
Failed: 0 test(s), Passed: 3 test(s), Total: 3 test(s)
Name: TestDataFormatterLanguageCategoryUpdates
Failed: 0 test(s), Passed: 3 test(s), Total: 3 test(s)
Name: TestDataFormatterLibccIterator
Failed: 0 test(s), Passed: 0 test(s), Total: 3 test(s)
Name: TestDataFormatterLibccMap
Failed: 0 test(s), Passed: 0 test(s), Total: 3 test(s)
Name: TestDataFormatterLibccMultiMap
Failed: 0 test(s), Passed: 0 test(s), Total: 3 test(s)
Name: TestDataFormatterLibcxxList
Failed: 0 test(s), Passed: 0 test(s), Total: 3 test(s)
Name: TestDataFormatterLibcxxListLoop
Failed: 0 test(s), Passed: 0 test(s), Total: 3 test(s)
Name: TestDataFormatterLibcxxMultiSet
Failed: 0 test(s), Passed: 0 test(s), Total: 3 test(s)
Name: TestDataFormatterLibcxxSet
Failed: 0 test(s), Passed: 3 test(s), Total: 3 test(s)
Name: TestDataFormatterLibcxxString
Failed: 0 test(s), Passed: 0 test(s), Total: 3 test(s)
Name: TestDataFormatterLibcxxVBool
Failed: 0 test(s), Passed: 3 test(s), Total: 3 test(s)
Name: TestDataFormatterLibcxxVector
Failed: 0 test(s), Passed: 0 test(s), Total: 3 test(s)
Name: TestDataFormatterNamedSummaries
Failed: 0 test(s), Passed: 3 test(s), Total: 3 test(s)
Name: TestDataFormatterPythonSynth
Failed: 0 test(s), Passed: 6 test(s), Total: 6 test(s)
Name: TestDataFormatterRefPtrRecursion
Failed: 0 test(s), Passed: 3 test(s), Total: 3 test(s)
Name: TestDataFormatterScript
Failed: 0 test(s), Passed: 3 test(s), Total: 3 test(s)
Name: TestDataFormatterSkipSummary
Failed: 0 test(s), Passed: 3 test(s), Total: 3 test(s)
Name: TestDataFormatterSmartArray
Failed: 0 test(s), Passed: 3 test(s), Total: 3 test(s)
Name: TestDataFormatterStdIterator
Failed: 0 test(s), Passed: 3 test(s), Total: 3 test(s)
Name: TestDataFormatterStdList
Failed: 0 test(s), Passed: 3 test(s), Total: 3 test(s)
Name: TestDataFormatterStdMap
Failed: 0 test(s), Passed: 3 test(s), Total: 3 test(s)
Name: TestDataFormatterStdSmartPtr
Failed: 0 test(s), Passed: 3 test(s), Total: 3 test(s)
Name: TestDataFormatterStdString
Failed: 0 test(s), Passed: 3 test(s), Total: 3 test(s)
Name: TestDataFormatterStdTuple
Failed: 0 test(s), Passed: 3 test(s), Total: 3 test(s)
Name: TestDataFormatterStdUniquePtr
Failed: 0 test(s), Passed: 3 test(s), Total: 3 test(s)
Name: TestDataFormatterStdVBool
Failed: 0 test(s), Passed: 3 test(s), Total: 3 test(s)
Name: TestDataFormatterStdVector
Failed: 0 test(s), Passed: 3 test(s), Total: 3 test(s)
Name: TestDataFormatterSynth
Failed: 0 test(s), Passed: 3 test(s), Total: 3 test(s)
Name: TestDataFormatterSynthType
Failed: 0 test(s), Passed: 3 test(s), Total: 3 test(s)
Name: TestDataFormatterSynthVal
Failed: 0 test(s), Passed: 3 test(s), Total: 3 test(s)
Name: TestDataFormatterUnordered
Failed: 0 test(s), Passed: 0 test(s), Total: 3 test(s)
Name: TestDataFormatterVarScriptFormatting
Failed: 0 test(s), Passed: 3 test(s), Total: 3 test(s)
Name: TestDeadStrip
Failed: 0 test(s), Passed: 3 test(s), Total: 3 test(s)
Name: TestDebugBreak
Failed: 0 test(s), Passed: 1 test(s), Total: 1 test(s)
Name: TestDebuggerAPI
Failed: 0 test(s), Passed: 4 test(s), Total: 4 test(s)
Name: TestDefaultCacheLineSize
Failed: 0 test(s), Passed: 0 test(s), Total: 3 test(s)
Name: TestDefaultConstructorForAPIObjects
Failed: 0 test(s), Passed: 35 test(s), Total: 35 test(s)
Name: TestDefiningOverloadedFunctions
Failed: 0 test(s), Passed: 3 test(s), Total: 3 test(s)
Name: TestDiamond
Failed: 0 test(s), Passed: 3 test(s), Total: 3 test(s)
Name: TestDisasmAPI
Failed: 0 test(s), Passed: 3 test(s), Total: 3 test(s)
Name: TestDisassembleBreakpoint
Failed: 0 test(s), Passed: 3 test(s), Total: 3 test(s)
Name: TestDisassembleRawData
Failed: 0 test(s), Passed: 1 test(s), Total: 1 test(s)
Name: TestDisassemble_VST1_64
Failed: 0 test(s), Passed: 0 test(s), Total: 1 test(s)
Name: TestDynamicValue
Failed: 0 test(s), Passed: 3 test(s), Total: 3 test(s)
Name: TestDynamicValueChildCount
Failed: 0 test(s), Passed: 3 test(s), Total: 3 test(s)
Name: TestEhFrameUnwind
Failed: 0 test(s), Passed: 3 test(s), Total: 3 test(s)
Name: TestEmulations
Failed: 0 test(s), Passed: 2 test(s), Total: 2 test(s)
Name: TestEnumTypes
Failed: 0 test(s), Passed: 3 test(s), Total: 3 test(s)
Name: TestEnumVariables
Failed: 0 test(s), Passed: 3 test(s), Total: 3 test(s)
Name: TestEqualityOperators
Failed: 0 test(s), Passed: 9 test(s), Total: 9 test(s)
Name: TestEvents
Failed: 0 test(s), Passed: 0 test(s), Total: 9 test(s)
Name: TestExitDuringBreak
Failed: 0 test(s), Passed: 3 test(s), Total: 3 test(s)
Name: TestExitDuringStep
Failed: 0 test(s), Passed: 9 test(s), Total: 9 test(s)
Name: TestExprDoesntBlock
Failed: 0 test(s), Passed: 3 test(s), Total: 3 test(s)
Name: TestExprHelpExamples
Failed: 0 test(s), Passed: 3 test(s), Total: 3 test(s)
Name: TestExprInProtocolExtension
Failed: 3 test(s), Passed: 0 test(s), Total: 3 test(s)
Failed: TestExprInProtocolExtension.TestSwiftExprInProtocolExtension.test_protocol_extension_dwarf <https://ci.swift.org/job/oss-lldb-incremental-linux-ubuntu-16_04/2218/testReport/junit/TestExprInProtocolExtension/TestSwiftExprInProtocolExtension/test_protocol_extension_dwarf>
Failed: TestExprInProtocolExtension.TestSwiftExprInProtocolExtension.test_protocol_extension_dwo <https://ci.swift.org/job/oss-lldb-incremental-linux-ubuntu-16_04/2218/testReport/junit/TestExprInProtocolExtension/TestSwiftExprInProtocolExtension/test_protocol_extension_dwo>
Failed: TestExprInProtocolExtension.TestSwiftExprInProtocolExtension.test_protocol_extension_gmodules <https://ci.swift.org/job/oss-lldb-incremental-linux-ubuntu-16_04/2218/testReport/junit/TestExprInProtocolExtension/TestSwiftExprInProtocolExtension/test_protocol_extension_gmodules>
Name: TestExprOptions
Failed: 0 test(s), Passed: 3 test(s), Total: 3 test(s)
Name: TestExpressionAccessControl
Failed: 0 test(s), Passed: 3 test(s), Total: 3 test(s)
Name: TestExpressionErrorBreakpoint
Failed: 0 test(s), Passed: 9 test(s), Total: 12 test(s)
Name: TestExpressionErrors
Failed: 0 test(s), Passed: 3 test(s), Total: 3 test(s)
Name: TestExpressionInSyscall
Failed: 0 test(s), Passed: 3 test(s), Total: 3 test(s)
Name: TestExpressionScopes
Failed: 3 test(s), Passed: 0 test(s), Total: 3 test(s)
Failed: TestExpressionScopes.TestSwiftExpressionScopes.test_expression_scopes_dwarf <https://ci.swift.org/job/oss-lldb-incremental-linux-ubuntu-16_04/2218/testReport/junit/TestExpressionScopes/TestSwiftExpressionScopes/test_expression_scopes_dwarf>
Failed: TestExpressionScopes.TestSwiftExpressionScopes.test_expression_scopes_dwo <https://ci.swift.org/job/oss-lldb-incremental-linux-ubuntu-16_04/2218/testReport/junit/TestExpressionScopes/TestSwiftExpressionScopes/test_expression_scopes_dwo>
Failed: TestExpressionScopes.TestSwiftExpressionScopes.test_expression_scopes_gmodules <https://ci.swift.org/job/oss-lldb-incremental-linux-ubuntu-16_04/2218/testReport/junit/TestExpressionScopes/TestSwiftExpressionScopes/test_expression_scopes_gmodules>
Name: TestExprs
Failed: 0 test(s), Passed: 12 test(s), Total: 12 test(s)
Name: TestExprs2
Failed: 0 test(s), Passed: 3 test(s), Total: 3 test(s)
Name: TestExprsChar
Failed: 0 test(s), Passed: 9 test(s), Total: 9 test(s)
Name: TestFdLeak
Failed: 0 test(s), Passed: 3 test(s), Total: 3 test(s)
Name: TestFilePrivate
Failed: 0 test(s), Passed: 3 test(s), Total: 3 test(s)
Name: TestFindStructTypes
Failed: 0 test(s), Passed: 1 test(s), Total: 1 test(s)
Name: TestFixIts
Failed: 0 test(s), Passed: 3 test(s), Total: 3 test(s)
Name: TestFloatTypes
Failed: 0 test(s), Passed: 6 test(s), Total: 6 test(s)
Name: TestFloatTypesExpr
Failed: 0 test(s), Passed: 6 test(s), Total: 6 test(s)
Name: TestFormatPropagation
Failed: 0 test(s), Passed: 3 test(s), Total: 3 test(s)
Name: TestFormats
Failed: 0 test(s), Passed: 3 test(s), Total: 3 test(s)
Name: TestFormatters
Failed: 0 test(s), Passed: 3 test(s), Total: 3 test(s)
Name: TestFormattersSBAPI
Failed: 0 test(s), Passed: 6 test(s), Total: 6 test(s)
Name: TestForwardDeclaration
Failed: 0 test(s), Passed: 3 test(s), Total: 3 test(s)
Name: TestFrameDisassemble
Failed: 0 test(s), Passed: 1 test(s), Total: 1 test(s)
Name: TestFrameFormatSmallStruct
Failed: 0 test(s), Passed: 3 test(s), Total: 3 test(s)
Name: TestFrameUtils
Failed: 0 test(s), Passed: 3 test(s), Total: 3 test(s)
Name: TestFrameVariableAnonymousUnions
Failed: 0 test(s), Passed: 3 test(s), Total: 3 test(s)
Name: TestFrames
Failed: 0 test(s), Passed: 9 test(s), Total: 9 test(s)
Name: TestFunctionTypes
Failed: 0 test(s), Passed: 6 test(s), Total: 6 test(s)
Name: TestFunctionVariables
Failed: 0 test(s), Passed: 3 test(s), Total: 3 test(s)
Name: TestGCore
Failed: 0 test(s), Passed: 2 test(s), Total: 2 test(s)
Name: TestGdbRemoteAbort
Failed: 0 test(s), Passed: 1 test(s), Total: 1 test(s)
Name: TestGdbRemoteAttach
Failed: 0 test(s), Passed: 1 test(s), Total: 1 test(s)
Name: TestGdbRemoteAuxvSupport
Failed: 0 test(s), Passed: 4 test(s), Total: 4 test(s)
Name: TestGdbRemoteExitCode
Failed: 0 test(s), Passed: 3 test(s), Total: 3 test(s)
Name: TestGdbRemoteExpeditedRegisters
Failed: 0 test(s), Passed: 5 test(s), Total: 5 test(s)
Name: TestGdbRemoteHostInfo
Failed: 0 test(s), Passed: 1 test(s), Total: 1 test(s)
Name: TestGdbRemoteKill
Failed: 0 test(s), Passed: 1 test(s), Total: 1 test(s)
Name: TestGdbRemoteModuleInfo
Failed: 0 test(s), Passed: 1 test(s), Total: 1 test(s)
Name: TestGdbRemoteProcessInfo
Failed: 0 test(s), Passed: 5 test(s), Total: 5 test(s)
Name: TestGdbRemoteRegisterState
Failed: 0 test(s), Passed: 2 test(s), Total: 2 test(s)
Name: TestGdbRemoteSegFault
Failed: 0 test(s), Passed: 1 test(s), Total: 1 test(s)
Name: TestGdbRemoteSingleStep
Failed: 0 test(s), Passed: 1 test(s), Total: 1 test(s)
Name: TestGdbRemoteThreadsInStopReply
Failed: 0 test(s), Passed: 4 test(s), Total: 4 test(s)
Name: TestGdbRemote_qThreadStopInfo
Failed: 0 test(s), Passed: 3 test(s), Total: 4 test(s)
Name: TestGdbRemote_vCont
Failed: 0 test(s), Passed: 6 test(s), Total: 6 test(s)
Name: TestGlobalVariables
Failed: 0 test(s), Passed: 3 test(s), Total: 3 test(s)
Name: TestGoFormatters
Failed: 0 test(s), Passed: 0 test(s), Total: 1 test(s)
Name: TestGoroutines
Failed: 0 test(s), Passed: 0 test(s), Total: 1 test(s)
Name: TestGuessLanguage
Failed: 0 test(s), Passed: 1 test(s), Total: 1 test(s)
Name: TestHandleSegv
Failed: 0 test(s), Passed: 3 test(s), Total: 3 test(s)
Name: TestHelloWorld
Failed: 0 test(s), Passed: 9 test(s), Total: 9 test(s)
Name: TestHelp
Failed: 0 test(s), Passed: 18 test(s), Total: 18 test(s)
Name: TestIRInterpreter
Failed: 0 test(s), Passed: 3 test(s), Total: 3 test(s)
Name: TestIRInterpreterPHINodes
Failed: 0 test(s), Passed: 3 test(s), Total: 3 test(s)
Name: TestImageListMultiArchitecture
Failed: 0 test(s), Passed: 1 test(s), Total: 1 test(s)
Name: TestImport
Failed: 0 test(s), Passed: 1 test(s), Total: 1 test(s)
Name: TestInOutVariables
Failed: 3 test(s), Passed: 0 test(s), Total: 3 test(s)
Failed: TestInOutVariables.TestInOutVariables.test_in_out_variables_dwarf <https://ci.swift.org/job/oss-lldb-incremental-linux-ubuntu-16_04/2218/testReport/junit/TestInOutVariables/TestInOutVariables/test_in_out_variables_dwarf>
Failed: TestInOutVariables.TestInOutVariables.test_in_out_variables_dwo <https://ci.swift.org/job/oss-lldb-incremental-linux-ubuntu-16_04/2218/testReport/junit/TestInOutVariables/TestInOutVariables/test_in_out_variables_dwo>
Failed: TestInOutVariables.TestInOutVariables.test_in_out_variables_gmodules <https://ci.swift.org/job/oss-lldb-incremental-linux-ubuntu-16_04/2218/testReport/junit/TestInOutVariables/TestInOutVariables/test_in_out_variables_gmodules>
Name: TestIndexVariable
Failed: 0 test(s), Passed: 3 test(s), Total: 3 test(s)
Name: TestIndirectEnumVariables
Failed: 0 test(s), Passed: 0 test(s), Total: 6 test(s)
Name: TestInferiorAssert
Failed: 0 test(s), Passed: 18 test(s), Total: 18 test(s)
Name: TestInferiorChanged
Failed: 0 test(s), Passed: 1 test(s), Total: 1 test(s)
Name: TestInferiorCrashing
Failed: 0 test(s), Passed: 18 test(s), Total: 21 test(s)
Name: TestInitializerList
Failed: 0 test(s), Passed: 3 test(s), Total: 3 test(s)
Name: TestInlineStepping
Failed: 0 test(s), Passed: 9 test(s), Total: 9 test(s)
Name: TestInlinedBreakpoints
Failed: 0 test(s), Passed: 3 test(s), Total: 3 test(s)
Name: TestInlinedFrame
Failed: 0 test(s), Passed: 3 test(s), Total: 3 test(s)
Name: TestInlines
Failed: 0 test(s), Passed: 3 test(s), Total: 3 test(s)
Name: TestIntegerTypes
Failed: 0 test(s), Passed: 30 test(s), Total: 30 test(s)
Name: TestIntegerTypesExpr
Failed: 0 test(s), Passed: 30 test(s), Total: 30 test(s)
Name: TestJITLoaderGDB
Failed: 0 test(s), Passed: 0 test(s), Total: 3 test(s)
Name: TestLLDBIterator
Failed: 0 test(s), Passed: 9 test(s), Total: 9 test(s)
Name: TestLLVM
Failed: 0 test(s), Passed: 1 test(s), Total: 1 test(s)
Name: TestLaunchWithShellExpand
Failed: 0 test(s), Passed: 3 test(s), Total: 3 test(s)
Name: TestLazyReverse
Failed: 0 test(s), Passed: 1 test(s), Total: 1 test(s)
Name: TestLibCxxAtomic
Failed: 0 test(s), Passed: 0 test(s), Total: 3 test(s)
Name: TestLibCxxFunction
Failed: 0 test(s), Passed: 0 test(s), Total: 3 test(s)
Name: TestLinuxCore
Failed: 0 test(s), Passed: 6 test(s), Total: 6 test(s)
Name: TestLinuxCoreThreads
Failed: 0 test(s), Passed: 2 test(s), Total: 2 test(s)
Name: TestListener
Failed: 0 test(s), Passed: 3 test(s), Total: 3 test(s)
Name: TestLldbGdbServer
Failed: 0 test(s), Passed: 33 test(s), Total: 33 test(s)
Name: TestLoadUnload
Failed: 0 test(s), Passed: 18 test(s), Total: 18 test(s)
Name: TestLogging
Failed: 0 test(s), Passed: 5 test(s), Total: 5 test(s)
Name: TestLongjmp
Failed: 0 test(s), Passed: 9 test(s), Total: 9 test(s)
Name: TestMPXRegisters
Failed: 0 test(s), Passed: 0 test(s), Total: 3 test(s)
Name: TestMacros
Failed: 0 test(s), Passed: 3 test(s), Total: 3 test(s)
Name: TestMembersAndLocalsWithSameName
Failed: 0 test(s), Passed: 6 test(s), Total: 6 test(s)
Name: TestMemoryCache
Failed: 0 test(s), Passed: 3 test(s), Total: 3 test(s)
Name: TestMemoryFind
Failed: 0 test(s), Passed: 3 test(s), Total: 3 test(s)
Name: TestMemoryHistory
Failed: 0 test(s), Passed: 3 test(s), Total: 3 test(s)
Name: TestMemoryRead
Failed: 0 test(s), Passed: 3 test(s), Total: 3 test(s)
Name: TestMiBreak
Failed: 0 test(s), Passed: 7 test(s), Total: 7 test(s)
Name: TestMiCliSupport
Failed: 0 test(s), Passed: 1 test(s), Total: 8 test(s)
Name: TestMiData
Failed: 0 test(s), Passed: 6 test(s), Total: 7 test(s)
Name: TestMiEnvironmentCd
Failed: 0 test(s), Passed: 1 test(s), Total: 1 test(s)
Name: TestMiExec
Failed: 0 test(s), Passed: 9 test(s), Total: 9 test(s)
Name: TestMiExit
Failed: 0 test(s), Passed: 3 test(s), Total: 3 test(s)
Name: TestMiFile
Failed: 0 test(s), Passed: 4 test(s), Total: 4 test(s)
Name: TestMiGdbSetShow
Failed: 0 test(s), Passed: 8 test(s), Total: 9 test(s)
Name: TestMiGdbSetShowPrint
Failed: 0 test(s), Passed: 2 test(s), Total: 3 test(s)
Name: TestMiInterpreterExec
Failed: 0 test(s), Passed: 8 test(s), Total: 8 test(s)
Name: TestMiLibraryLoaded
Failed: 0 test(s), Passed: 1 test(s), Total: 1 test(s)
Name: TestMiPrompt
Failed: 0 test(s), Passed: 1 test(s), Total: 1 test(s)
Name: TestMiSignal
Failed: 0 test(s), Passed: 1 test(s), Total: 3 test(s)
Name: TestMiStack
Failed: 0 test(s), Passed: 6 test(s), Total: 6 test(s)
Name: TestMiStartupOptions
Failed: 0 test(s), Passed: 8 test(s), Total: 10 test(s)
Name: TestMiSymbol
Failed: 0 test(s), Passed: 1 test(s), Total: 1 test(s)
Name: TestMiSyntax
Failed: 0 test(s), Passed: 4 test(s), Total: 4 test(s)
Name: TestMiTarget
Failed: 0 test(s), Passed: 0 test(s), Total: 3 test(s)
Name: TestMiThreadInfo
Failed: 0 test(s), Passed: 1 test(s), Total: 1 test(s)
Name: TestMiVar
Failed: 0 test(s), Passed: 2 test(s), Total: 6 test(s)
Name: TestMiniDump
Failed: 0 test(s), Passed: 3 test(s), Total: 5 test(s)
Name: TestMiniDumpNew
Failed: 0 test(s), Passed: 8 test(s), Total: 8 test(s)
Name: TestMixedLanguages
Failed: 0 test(s), Passed: 3 test(s), Total: 3 test(s)
Name: TestModuleAndSection
Failed: 0 test(s), Passed: 9 test(s), Total: 9 test(s)
Name: TestMultilineExpressions
Failed: 0 test(s), Passed: 3 test(s), Total: 3 test(s)
Name: TestMultipleBreakpoints
Failed: 0 test(s), Passed: 3 test(s), Total: 3 test(s)
Name: TestMultipleDebuggers
Failed: 0 test(s), Passed: 3 test(s), Total: 3 test(s)
Name: TestMultipleDebuggersCommands
Failed: 0 test(s), Passed: 1 test(s), Total: 1 test(s)
Name: TestMultipleHits
Failed: 0 test(s), Passed: 1 test(s), Total: 1 test(s)
Name: TestMultipleTargets
Failed: 0 test(s), Passed: 1 test(s), Total: 1 test(s)
Name: TestMultithreaded
Failed: 0 test(s), Passed: 0 test(s), Total: 12 test(s)
Name: TestMyFirstWatchpoint
Failed: 3 test(s), Passed: 0 test(s), Total: 3 test(s)
Failed: TestMyFirstWatchpoint.HelloWatchpointTestCase.test_hello_watchpoint_using_watchpoint_set_dwarf <https://ci.swift.org/job/oss-lldb-incremental-linux-ubuntu-16_04/2218/testReport/junit/TestMyFirstWatchpoint/HelloWatchpointTestCase/test_hello_watchpoint_using_watchpoint_set_dwarf>
Failed: TestMyFirstWatchpoint.HelloWatchpointTestCase.test_hello_watchpoint_using_watchpoint_set_dwo <https://ci.swift.org/job/oss-lldb-incremental-linux-ubuntu-16_04/2218/testReport/junit/TestMyFirstWatchpoint/HelloWatchpointTestCase/test_hello_watchpoint_using_watchpoint_set_dwo>
Failed: TestMyFirstWatchpoint.HelloWatchpointTestCase.test_hello_watchpoint_using_watchpoint_set_gmodules <https://ci.swift.org/job/oss-lldb-incremental-linux-ubuntu-16_04/2218/testReport/junit/TestMyFirstWatchpoint/HelloWatchpointTestCase/test_hello_watchpoint_using_watchpoint_set_gmodules>
Name: TestNameLookup
Failed: 0 test(s), Passed: 3 test(s), Total: 3 test(s)
Name: TestNamespace
Failed: 0 test(s), Passed: 12 test(s), Total: 12 test(s)
Name: TestNamespaceDefinitions
Failed: 0 test(s), Passed: 3 test(s), Total: 3 test(s)
Name: TestNamespaceLookup
Failed: 0 test(s), Passed: 24 test(s), Total: 24 test(s)
Name: TestNestedAlias
Failed: 0 test(s), Passed: 3 test(s), Total: 3 test(s)
Name: TestNestedPersistentTypes
Failed: 0 test(s), Passed: 3 test(s), Total: 3 test(s)
Name: TestNoSuchArch
Failed: 0 test(s), Passed: 3 test(s), Total: 3 test(s)
Name: TestNoreturnUnwind
Failed: 0 test(s), Passed: 3 test(s), Total: 3 test(s)
Name: TestNumThreads
Failed: 0 test(s), Passed: 3 test(s), Total: 3 test(s)
Name: TestOverloadedFunctions
Failed: 0 test(s), Passed: 3 test(s), Total: 3 test(s)
Name: TestPOUnwrapping
Failed: 0 test(s), Passed: 1 test(s), Total: 1 test(s)
Name: TestPaths
Failed: 0 test(s), Passed: 2 test(s), Total: 3 test(s)
Name: TestPersistentPtrUpdate
Failed: 0 test(s), Passed: 3 test(s), Total: 3 test(s)
Name: TestPersistentTypes
Failed: 0 test(s), Passed: 3 test(s), Total: 3 test(s)
Name: TestPersistentVariables
Failed: 0 test(s), Passed: 3 test(s), Total: 3 test(s)
Name: TestPlatformCommand
Failed: 0 test(s), Passed: 7 test(s), Total: 8 test(s)
Name: TestPlatformProcessConnect
Failed: 0 test(s), Passed: 0 test(s), Total: 1 test(s)
Name: TestPluginCommands
Failed: 0 test(s), Passed: 1 test(s), Total: 1 test(s)
Name: TestPrintArray
Failed: 0 test(s), Passed: 3 test(s), Total: 3 test(s)
Name: TestPrintStackTraces
Failed: 0 test(s), Passed: 3 test(s), Total: 3 test(s)
Name: TestPrintfAfterUp
Failed: 0 test(s), Passed: 3 test(s), Total: 3 test(s)
Name: TestProcessAPI
Failed: 0 test(s), Passed: 15 test(s), Total: 15 test(s)
Name: TestProcessAttach
Failed: 0 test(s), Passed: 2 test(s), Total: 2 test(s)
Name: TestProcessIO
Failed: 0 test(s), Passed: 15 test(s), Total: 15 test(s)
Name: TestProcessLaunch
Failed: 0 test(s), Passed: 9 test(s), Total: 9 test(s)
Name: TestProcessSaveCore
Failed: 0 test(s), Passed: 0 test(s), Total: 6 test(s)
Name: TestPtrRef2Typedef
Failed: 0 test(s), Passed: 3 test(s), Total: 3 test(s)
Name: TestPtrToArrayFormatting
Failed: 0 test(s), Passed: 3 test(s), Total: 3 test(s)
Name: TestPublicAPIHeaders
Failed: 0 test(s), Passed: 0 test(s), Total: 3 test(s)
Name: TestPyObjSynthProvider
Failed: 0 test(s), Passed: 1 test(s), Total: 1 test(s)
Name: TestPythonOSPlugin
Failed: 0 test(s), Passed: 3 test(s), Total: 3 test(s)
Name: TestQuoting
Failed: 0 test(s), Passed: 11 test(s), Total: 11 test(s)
Name: TestREPLClasses
Failed: 0 test(s), Passed: 1 test(s), Total: 1 test(s)
Name: TestREPLRecursiveClass
Failed: 0 test(s), Passed: 1 test(s), Total: 1 test(s)
Name: TestREPLStructs
Failed: 0 test(s), Passed: 1 test(s), Total: 1 test(s)
Name: TestRaise
Failed: 0 test(s), Passed: 9 test(s), Total: 9 test(s)
Name: TestRdar12586188
Failed: 0 test(s), Passed: 1 test(s), Total: 1 test(s)
Name: TestRecursiveInferior
Failed: 0 test(s), Passed: 18 test(s), Total: 21 test(s)
Name: TestRecursiveTypes
Failed: 0 test(s), Passed: 6 test(s), Total: 6 test(s)
Name: TestRegexpBreakCommand
Failed: 0 test(s), Passed: 3 test(s), Total: 3 test(s)
Name: TestRegisterVariables
Failed: 0 test(s), Passed: 3 test(s), Total: 3 test(s)
Name: TestRegisters
Failed: 0 test(s), Passed: 21 test(s), Total: 21 test(s)
Name: TestRegistersIterator
Failed: 0 test(s), Passed: 3 test(s), Total: 3 test(s)
Name: TestReportData
Failed: 0 test(s), Passed: 3 test(s), Total: 3 test(s)
Name: TestRerun
Failed: 0 test(s), Passed: 3 test(s), Total: 3 test(s)
Name: TestReturnValue
Failed: 0 test(s), Passed: 3 test(s), Total: 3 test(s)
Name: TestRvalueReferences
Failed: 0 test(s), Passed: 3 test(s), Total: 3 test(s)
Name: TestSBData
Failed: 0 test(s), Passed: 3 test(s), Total: 3 test(s)
Name: TestSBFrameFindValue
Failed: 0 test(s), Passed: 3 test(s), Total: 3 test(s)
Name: TestSBValuePersist
Failed: 0 test(s), Passed: 3 test(s), Total: 3 test(s)
Name: TestSBValueUpdates
Failed: 3 test(s), Passed: 0 test(s), Total: 3 test(s)
Failed: TestSBValueUpdates.TestSBValueUpdates.test_update_and_format_with_type_change_dwarf <https://ci.swift.org/job/oss-lldb-incremental-linux-ubuntu-16_04/2218/testReport/junit/TestSBValueUpdates/TestSBValueUpdates/test_update_and_format_with_type_change_dwarf>
Failed: TestSBValueUpdates.TestSBValueUpdates.test_update_and_format_with_type_change_dwo <https://ci.swift.org/job/oss-lldb-incremental-linux-ubuntu-16_04/2218/testReport/junit/TestSBValueUpdates/TestSBValueUpdates/test_update_and_format_with_type_change_dwo>
Failed: TestSBValueUpdates.TestSBValueUpdates.test_update_and_format_with_type_change_gmodules <https://ci.swift.org/job/oss-lldb-incremental-linux-ubuntu-16_04/2218/testReport/junit/TestSBValueUpdates/TestSBValueUpdates/test_update_and_format_with_type_change_gmodules>
Name: TestSTL
Failed: 0 test(s), Passed: 6 test(s), Total: 6 test(s)
Name: TestSTTYBeforeAndAfter
Failed: 0 test(s), Passed: 0 test(s), Total: 1 test(s)
Name: TestSaveJITObjects
Failed: 0 test(s), Passed: 3 test(s), Total: 3 test(s)
Name: TestSectionAPI
Failed: 0 test(s), Passed: 3 test(s), Total: 3 test(s)
Name: TestSendSignal
Failed: 0 test(s), Passed: 3 test(s), Total: 3 test(s)
Name: TestSequenceFunctions
Failed: 0 test(s), Passed: 3 test(s), Total: 3 test(s)
Name: TestSetValues
Failed: 0 test(s), Passed: 3 test(s), Total: 3 test(s)
Name: TestSetWatchlocation
Failed: 3 test(s), Passed: 0 test(s), Total: 3 test(s)
Failed: TestSetWatchlocation.SetWatchlocationAPITestCase.test_watch_location_dwarf <https://ci.swift.org/job/oss-lldb-incremental-linux-ubuntu-16_04/2218/testReport/junit/TestSetWatchlocation/SetWatchlocationAPITestCase/test_watch_location_dwarf>
Failed: TestSetWatchlocation.SetWatchlocationAPITestCase.test_watch_location_dwo <https://ci.swift.org/job/oss-lldb-incremental-linux-ubuntu-16_04/2218/testReport/junit/TestSetWatchlocation/SetWatchlocationAPITestCase/test_watch_location_dwo>
Failed: TestSetWatchlocation.SetWatchlocationAPITestCase.test_watch_location_gmodules <https://ci.swift.org/job/oss-lldb-incremental-linux-ubuntu-16_04/2218/testReport/junit/TestSetWatchlocation/SetWatchlocationAPITestCase/test_watch_location_gmodules>
Name: TestSetWatchpoint
Failed: 3 test(s), Passed: 0 test(s), Total: 3 test(s)
Failed: TestSetWatchpoint.SetWatchpointAPITestCase.test_watch_val_dwarf <https://ci.swift.org/job/oss-lldb-incremental-linux-ubuntu-16_04/2218/testReport/junit/TestSetWatchpoint/SetWatchpointAPITestCase/test_watch_val_dwarf>
Failed: TestSetWatchpoint.SetWatchpointAPITestCase.test_watch_val_dwo <https://ci.swift.org/job/oss-lldb-incremental-linux-ubuntu-16_04/2218/testReport/junit/TestSetWatchpoint/SetWatchpointAPITestCase/test_watch_val_dwo>
Failed: TestSetWatchpoint.SetWatchpointAPITestCase.test_watch_val_gmodules <https://ci.swift.org/job/oss-lldb-incremental-linux-ubuntu-16_04/2218/testReport/junit/TestSetWatchpoint/SetWatchpointAPITestCase/test_watch_val_gmodules>
Name: TestSettings
Failed: 0 test(s), Passed: 29 test(s), Total: 29 test(s)
Name: TestSharedLib
Failed: 0 test(s), Passed: 6 test(s), Total: 6 test(s)
Name: TestSharedLibStrippedSymbols
Failed: 0 test(s), Passed: 6 test(s), Total: 6 test(s)
Name: TestSignalsAPI
Failed: 0 test(s), Passed: 3 test(s), Total: 3 test(s)
Name: TestSignedTypes
Failed: 0 test(s), Passed: 3 test(s), Total: 3 test(s)
Name: TestSimpleExpressions
Failed: 3 test(s), Passed: 0 test(s), Total: 3 test(s)
Failed: TestSimpleExpressions.TestSimpleSwiftExpressions.test_simple_swift_expressions_dwarf <https://ci.swift.org/job/oss-lldb-incremental-linux-ubuntu-16_04/2218/testReport/junit/TestSimpleExpressions/TestSimpleSwiftExpressions/test_simple_swift_expressions_dwarf>
Failed: TestSimpleExpressions.TestSimpleSwiftExpressions.test_simple_swift_expressions_dwo <https://ci.swift.org/job/oss-lldb-incremental-linux-ubuntu-16_04/2218/testReport/junit/TestSimpleExpressions/TestSimpleSwiftExpressions/test_simple_swift_expressions_dwo>
Failed: TestSimpleExpressions.TestSimpleSwiftExpressions.test_simple_swift_expressions_gmodules <https://ci.swift.org/job/oss-lldb-incremental-linux-ubuntu-16_04/2218/testReport/junit/TestSimpleExpressions/TestSimpleSwiftExpressions/test_simple_swift_expressions_gmodules>
Name: TestSingleQuoteInFilename
Failed: 0 test(s), Passed: 1 test(s), Total: 1 test(s)
Name: TestSourceManager
Failed: 0 test(s), Passed: 5 test(s), Total: 5 test(s)
Name: TestSourceRegexBreakpoints
Failed: 0 test(s), Passed: 6 test(s), Total: 6 test(s)
Name: TestStaticVariables
Failed: 0 test(s), Passed: 6 test(s), Total: 6 test(s)
Name: TestStepAndBreakpoints
Failed: 0 test(s), Passed: 3 test(s), Total: 3 test(s)
Name: TestStepNoDebug
Failed: 0 test(s), Passed: 9 test(s), Total: 9 test(s)
Name: TestStepOverWatchpoint
Failed: 0 test(s), Passed: 3 test(s), Total: 3 test(s)
Name: TestStepTarget
Failed: 0 test(s), Passed: 15 test(s), Total: 15 test(s)
Name: TestStepUntil
Failed: 0 test(s), Passed: 12 test(s), Total: 12 test(s)
Name: TestStopHookCmd
Failed: 0 test(s), Passed: 4 test(s), Total: 4 test(s)
Name: TestStopHookMechanism
Failed: 0 test(s), Passed: 3 test(s), Total: 3 test(s)
Name: TestStopHookMultipleThreads
Failed: 0 test(s), Passed: 3 test(s), Total: 3 test(s)
Name: TestStubReverseConnect
Failed: 0 test(s), Passed: 1 test(s), Total: 1 test(s)
Name: TestStubSetSID
Failed: 0 test(s), Passed: 3 test(s), Total: 3 test(s)
Name: TestSwiftAnyObjectType
Failed: 0 test(s), Passed: 3 test(s), Total: 3 test(s)
Name: TestSwiftAnyType
Failed: 0 test(s), Passed: 3 test(s), Total: 3 test(s)
Name: TestSwiftArchetypeResolution
Failed: 3 test(s), Passed: 0 test(s), Total: 3 test(s)
Failed: TestSwiftArchetypeResolution.TestSwiftArchetypeResolution.test_swift_archetype_resolution_dwarf <https://ci.swift.org/job/oss-lldb-incremental-linux-ubuntu-16_04/2218/testReport/junit/TestSwiftArchetypeResolution/TestSwiftArchetypeResolution/test_swift_archetype_resolution_dwarf>
Failed: TestSwiftArchetypeResolution.TestSwiftArchetypeResolution.test_swift_archetype_resolution_dwo <https://ci.swift.org/job/oss-lldb-incremental-linux-ubuntu-16_04/2218/testReport/junit/TestSwiftArchetypeResolution/TestSwiftArchetypeResolution/test_swift_archetype_resolution_dwo>
Failed: TestSwiftArchetypeResolution.TestSwiftArchetypeResolution.test_swift_archetype_resolution_gmodules <https://ci.swift.org/job/oss-lldb-incremental-linux-ubuntu-16_04/2218/testReport/junit/TestSwiftArchetypeResolution/TestSwiftArchetypeResolution/test_swift_archetype_resolution_gmodules>
Name: TestSwiftArrayType
Failed: 0 test(s), Passed: 0 test(s), Total: 3 test(s)
Name: TestSwiftAssociatedTypeResolution
Failed: 0 test(s), Passed: 3 test(s), Total: 3 test(s)
Name: TestSwiftBacktracePrinting
Failed: 0 test(s), Passed: 3 test(s), Total: 3 test(s)
Name: TestSwiftBreakByPartialName
Failed: 0 test(s), Passed: 3 test(s), Total: 3 test(s)
Name: TestSwiftClassTypes
Failed: 0 test(s), Passed: 3 test(s), Total: 3 test(s)
Name: TestSwiftConditionalBreakpoint
Failed: 0 test(s), Passed: 3 test(s), Total: 3 test(s)
Name: TestSwiftDynamicValue
Failed: 3 test(s), Passed: 0 test(s), Total: 3 test(s)
Failed: TestSwiftDynamicValue.SwiftDynamicValueTest.test_dynamic_value_dwarf <https://ci.swift.org/job/oss-lldb-incremental-linux-ubuntu-16_04/2218/testReport/junit/TestSwiftDynamicValue/SwiftDynamicValueTest/test_dynamic_value_dwarf>
Failed: TestSwiftDynamicValue.SwiftDynamicValueTest.test_dynamic_value_dwo <https://ci.swift.org/job/oss-lldb-incremental-linux-ubuntu-16_04/2218/testReport/junit/TestSwiftDynamicValue/SwiftDynamicValueTest/test_dynamic_value_dwo>
Failed: TestSwiftDynamicValue.SwiftDynamicValueTest.test_dynamic_value_gmodules <https://ci.swift.org/job/oss-lldb-incremental-linux-ubuntu-16_04/2218/testReport/junit/TestSwiftDynamicValue/SwiftDynamicValueTest/test_dynamic_value_gmodules>
Name: TestSwiftExpressionsInClassFunctions
Failed: 3 test(s), Passed: 0 test(s), Total: 3 test(s)
Failed: TestSwiftExpressionsInClassFunctions.TestSwiftExpressionsInClassFunctions.test_expressions_in_class_functions_dwarf <https://ci.swift.org/job/oss-lldb-incremental-linux-ubuntu-16_04/2218/testReport/junit/TestSwiftExpressionsInClassFunctions/TestSwiftExpressionsInClassFunctions/test_expressions_in_class_functions_dwarf>
Failed: TestSwiftExpressionsInClassFunctions.TestSwiftExpressionsInClassFunctions.test_expressions_in_class_functions_dwo <https://ci.swift.org/job/oss-lldb-incremental-linux-ubuntu-16_04/2218/testReport/junit/TestSwiftExpressionsInClassFunctions/TestSwiftExpressionsInClassFunctions/test_expressions_in_class_functions_dwo>
Failed: TestSwiftExpressionsInClassFunctions.TestSwiftExpressionsInClassFunctions.test_expressions_in_class_functions_gmodules <https://ci.swift.org/job/oss-lldb-incremental-linux-ubuntu-16_04/2218/testReport/junit/TestSwiftExpressionsInClassFunctions/TestSwiftExpressionsInClassFunctions/test_expressions_in_class_functions_gmodules>
Name: TestSwiftExpressionsInMethodsPureSwift
Failed: 0 test(s), Passed: 3 test(s), Total: 3 test(s)
Name: TestSwiftFixIts
Failed: 0 test(s), Passed: 3 test(s), Total: 3 test(s)
Name: TestSwiftGenericEnums
Failed: 0 test(s), Passed: 3 test(s), Total: 3 test(s)
Name: TestSwiftGenericExpressions
Failed: 0 test(s), Passed: 3 test(s), Total: 6 test(s)
Name: TestSwiftGenericTupleLabels
Failed: 3 test(s), Passed: 0 test(s), Total: 3 test(s)
Failed: TestSwiftGenericTupleLabels.TestSwiftGenericTupleLabels.test_generic_tuple_labels_dwarf <https://ci.swift.org/job/oss-lldb-incremental-linux-ubuntu-16_04/2218/testReport/junit/TestSwiftGenericTupleLabels/TestSwiftGenericTupleLabels/test_generic_tuple_labels_dwarf>
Failed: TestSwiftGenericTupleLabels.TestSwiftGenericTupleLabels.test_generic_tuple_labels_dwo <https://ci.swift.org/job/oss-lldb-incremental-linux-ubuntu-16_04/2218/testReport/junit/TestSwiftGenericTupleLabels/TestSwiftGenericTupleLabels/test_generic_tuple_labels_dwo>
Failed: TestSwiftGenericTupleLabels.TestSwiftGenericTupleLabels.test_generic_tuple_labels_gmodules <https://ci.swift.org/job/oss-lldb-incremental-linux-ubuntu-16_04/2218/testReport/junit/TestSwiftGenericTupleLabels/TestSwiftGenericTupleLabels/test_generic_tuple_labels_gmodules>
Name: TestSwiftGenericTypes
Failed: 3 test(s), Passed: 0 test(s), Total: 3 test(s)
Failed: TestSwiftGenericTypes.TestSwiftGenericTypes.test_swift_generic_types_dwarf <https://ci.swift.org/job/oss-lldb-incremental-linux-ubuntu-16_04/2218/testReport/junit/TestSwiftGenericTypes/TestSwiftGenericTypes/test_swift_generic_types_dwarf>
Failed: TestSwiftGenericTypes.TestSwiftGenericTypes.test_swift_generic_types_dwo <https://ci.swift.org/job/oss-lldb-incremental-linux-ubuntu-16_04/2218/testReport/junit/TestSwiftGenericTypes/TestSwiftGenericTypes/test_swift_generic_types_dwo>
Failed: TestSwiftGenericTypes.TestSwiftGenericTypes.test_swift_generic_types_gmodules <https://ci.swift.org/job/oss-lldb-incremental-linux-ubuntu-16_04/2218/testReport/junit/TestSwiftGenericTypes/TestSwiftGenericTypes/test_swift_generic_types_gmodules>
Name: TestSwiftGenericsResolution
Failed: 3 test(s), Passed: 0 test(s), Total: 3 test(s)
Failed: TestSwiftGenericsResolution.SwiftDynamicTypeGenericsTest.test_genericresolution_commands_dwarf <https://ci.swift.org/job/oss-lldb-incremental-linux-ubuntu-16_04/2218/testReport/junit/TestSwiftGenericsResolution/SwiftDynamicTypeGenericsTest/test_genericresolution_commands_dwarf>
Failed: TestSwiftGenericsResolution.SwiftDynamicTypeGenericsTest.test_genericresolution_commands_dwo <https://ci.swift.org/job/oss-lldb-incremental-linux-ubuntu-16_04/2218/testReport/junit/TestSwiftGenericsResolution/SwiftDynamicTypeGenericsTest/test_genericresolution_commands_dwo>
Failed: TestSwiftGenericsResolution.SwiftDynamicTypeGenericsTest.test_genericresolution_commands_gmodules <https://ci.swift.org/job/oss-lldb-incremental-linux-ubuntu-16_04/2218/testReport/junit/TestSwiftGenericsResolution/SwiftDynamicTypeGenericsTest/test_genericresolution_commands_gmodules>
Name: TestSwiftGetValueAsUnsigned
Failed: 0 test(s), Passed: 3 test(s), Total: 3 test(s)
Name: TestSwiftGlobals
Failed: 3 test(s), Passed: 0 test(s), Total: 3 test(s)
Failed: TestSwiftGlobals.TestSwiftGlobals.test_swift_globals_dwarf <https://ci.swift.org/job/oss-lldb-incremental-linux-ubuntu-16_04/2218/testReport/junit/TestSwiftGlobals/TestSwiftGlobals/test_swift_globals_dwarf>
Failed: TestSwiftGlobals.TestSwiftGlobals.test_swift_globals_dwo <https://ci.swift.org/job/oss-lldb-incremental-linux-ubuntu-16_04/2218/testReport/junit/TestSwiftGlobals/TestSwiftGlobals/test_swift_globals_dwo>
Failed: TestSwiftGlobals.TestSwiftGlobals.test_swift_globals_gmodules <https://ci.swift.org/job/oss-lldb-incremental-linux-ubuntu-16_04/2218/testReport/junit/TestSwiftGlobals/TestSwiftGlobals/test_swift_globals_gmodules>
Name: TestSwiftHideRuntimeSupport
Failed: 3 test(s), Passed: 0 test(s), Total: 3 test(s)
Failed: TestSwiftHideRuntimeSupport.TestSwiftHideRuntimeSupport.test_swift_hide_runtime_support_dwarf <https://ci.swift.org/job/oss-lldb-incremental-linux-ubuntu-16_04/2218/testReport/junit/TestSwiftHideRuntimeSupport/TestSwiftHideRuntimeSupport/test_swift_hide_runtime_support_dwarf>
Failed: TestSwiftHideRuntimeSupport.TestSwiftHideRuntimeSupport.test_swift_hide_runtime_support_dwo <https://ci.swift.org/job/oss-lldb-incremental-linux-ubuntu-16_04/2218/testReport/junit/TestSwiftHideRuntimeSupport/TestSwiftHideRuntimeSupport/test_swift_hide_runtime_support_dwo>
Failed: TestSwiftHideRuntimeSupport.TestSwiftHideRuntimeSupport.test_swift_hide_runtime_support_gmodules <https://ci.swift.org/job/oss-lldb-incremental-linux-ubuntu-16_04/2218/testReport/junit/TestSwiftHideRuntimeSupport/TestSwiftHideRuntimeSupport/test_swift_hide_runtime_support_gmodules>
Name: TestSwiftInstancePointerSetSP
Failed: 3 test(s), Passed: 0 test(s), Total: 3 test(s)
Failed: TestSwiftInstancePointerSetSP.TestSwiftInstancePointerSetSP.test_instancepointerset_sp_dwarf <https://ci.swift.org/job/oss-lldb-incremental-linux-ubuntu-16_04/2218/testReport/junit/TestSwiftInstancePointerSetSP/TestSwiftInstancePointerSetSP/test_instancepointerset_sp_dwarf>
Failed: TestSwiftInstancePointerSetSP.TestSwiftInstancePointerSetSP.test_instancepointerset_sp_dwo <https://ci.swift.org/job/oss-lldb-incremental-linux-ubuntu-16_04/2218/testReport/junit/TestSwiftInstancePointerSetSP/TestSwiftInstancePointerSetSP/test_instancepointerset_sp_dwo>
Failed: TestSwiftInstancePointerSetSP.TestSwiftInstancePointerSetSP.test_instancepointerset_sp_gmodules <https://ci.swift.org/job/oss-lldb-incremental-linux-ubuntu-16_04/2218/testReport/junit/TestSwiftInstancePointerSetSP/TestSwiftInstancePointerSetSP/test_instancepointerset_sp_gmodules>
Name: TestSwiftLetInt
Failed: 0 test(s), Passed: 3 test(s), Total: 3 test(s)
Name: TestSwiftMetadataSymbols
Failed: 0 test(s), Passed: 3 test(s), Total: 3 test(s)
Name: TestSwiftMetatype
Failed: 0 test(s), Passed: 3 test(s), Total: 3 test(s)
Name: TestSwiftModuleSearchPaths
Failed: 0 test(s), Passed: 3 test(s), Total: 3 test(s)
Name: TestSwiftMultipayloadEnum
Failed: 0 test(s), Passed: 3 test(s), Total: 3 test(s)
Name: TestSwiftNestedArray
Failed: 0 test(s), Passed: 3 test(s), Total: 3 test(s)
Name: TestSwiftOneCaseEnum
Failed: 3 test(s), Passed: 0 test(s), Total: 3 test(s)
Failed: TestSwiftOneCaseEnum.TestSwiftOneCaseEnum.test_swift_one_case_enum_dwarf <https://ci.swift.org/job/oss-lldb-incremental-linux-ubuntu-16_04/2218/testReport/junit/TestSwiftOneCaseEnum/TestSwiftOneCaseEnum/test_swift_one_case_enum_dwarf>
Failed: TestSwiftOneCaseEnum.TestSwiftOneCaseEnum.test_swift_one_case_enum_dwo <https://ci.swift.org/job/oss-lldb-incremental-linux-ubuntu-16_04/2218/testReport/junit/TestSwiftOneCaseEnum/TestSwiftOneCaseEnum/test_swift_one_case_enum_dwo>
Failed: TestSwiftOneCaseEnum.TestSwiftOneCaseEnum.test_swift_one_case_enum_gmodules <https://ci.swift.org/job/oss-lldb-incremental-linux-ubuntu-16_04/2218/testReport/junit/TestSwiftOneCaseEnum/TestSwiftOneCaseEnum/test_swift_one_case_enum_gmodules>
Name: TestSwiftOptionals
Failed: 0 test(s), Passed: 3 test(s), Total: 3 test(s)
Name: TestSwiftPrivateDeclName
Failed: 0 test(s), Passed: 3 test(s), Total: 3 test(s)
Name: TestSwiftPrivateTypeAlias
Failed: 0 test(s), Passed: 3 test(s), Total: 3 test(s)
Name: TestSwiftProtocolTypes
Failed: 0 test(s), Passed: 3 test(s), Total: 3 test(s)
Name: TestSwiftRangeTypes
Failed: 0 test(s), Passed: 3 test(s), Total: 3 test(s)
Name: TestSwiftReferenceStorageTypes
Failed: 0 test(s), Passed: 3 test(s), Total: 3 test(s)
Name: TestSwiftReturns
Failed: 0 test(s), Passed: 0 test(s), Total: 3 test(s)
Name: TestSwiftStaticStringVariables
Failed: 0 test(s), Passed: 3 test(s), Total: 3 test(s)
Name: TestSwiftStdlibDictionary
Failed: 0 test(s), Passed: 0 test(s), Total: 3 test(s)
Name: TestSwiftStdlibSet
Failed: 0 test(s), Passed: 3 test(s), Total: 3 test(s)
Name: TestSwiftStepping
Failed: 0 test(s), Passed: 3 test(s), Total: 3 test(s)
Name: TestSwiftStringVariables
Failed: 0 test(s), Passed: 3 test(s), Total: 3 test(s)
Name: TestSwiftStructChangeRerun
Failed: 0 test(s), Passed: 0 test(s), Total: 3 test(s)
Name: TestSwiftStructInit
Failed: 0 test(s), Passed: 3 test(s), Total: 3 test(s)
Name: TestSwiftTupleTypes
Failed: 0 test(s), Passed: 3 test(s), Total: 3 test(s)
Name: TestSwiftTypeAliasFormatters
Failed: 0 test(s), Passed: 3 test(s), Total: 3 test(s)
Name: TestSwiftTypeLookup
Failed: 0 test(s), Passed: 3 test(s), Total: 3 test(s)
Name: TestSwiftTypeMetadata
Failed: 0 test(s), Passed: 0 test(s), Total: 3 test(s)
Name: TestSwiftTypes
Failed: 0 test(s), Passed: 3 test(s), Total: 3 test(s)
Name: TestSwiftValueOfOptionals
Failed: 0 test(s), Passed: 3 test(s), Total: 3 test(s)
Name: TestSymbolAPI
Failed: 0 test(s), Passed: 3 test(s), Total: 3 test(s)
Name: TestSymbolContext
Failed: 0 test(s), Passed: 3 test(s), Total: 3 test(s)
Name: TestSymbolContextTwoFiles
Failed: 0 test(s), Passed: 6 test(s), Total: 6 test(s)
Name: TestSyntheticCapping
Failed: 0 test(s), Passed: 3 test(s), Total: 3 test(s)
Name: TestTargetAPI
Failed: 0 test(s), Passed: 30 test(s), Total: 30 test(s)
Name: TestTargetCommand
Failed: 0 test(s), Passed: 9 test(s), Total: 9 test(s)
Name: TestTargetWatchAddress
Failed: 3 test(s), Passed: 3 test(s), Total: 6 test(s)
Failed: TestTargetWatchAddress.TargetWatchAddressAPITestCase.test_watch_address_dwarf <https://ci.swift.org/job/oss-lldb-incremental-linux-ubuntu-16_04/2218/testReport/junit/TestTargetWatchAddress/TargetWatchAddressAPITestCase/test_watch_address_dwarf>
Failed: TestTargetWatchAddress.TargetWatchAddressAPITestCase.test_watch_address_dwo <https://ci.swift.org/job/oss-lldb-incremental-linux-ubuntu-16_04/2218/testReport/junit/TestTargetWatchAddress/TargetWatchAddressAPITestCase/test_watch_address_dwo>
Failed: TestTargetWatchAddress.TargetWatchAddressAPITestCase.test_watch_address_gmodules <https://ci.swift.org/job/oss-lldb-incremental-linux-ubuntu-16_04/2218/testReport/junit/TestTargetWatchAddress/TargetWatchAddressAPITestCase/test_watch_address_gmodules>
Name: TestTemplateArgs
Failed: 0 test(s), Passed: 6 test(s), Total: 6 test(s)
Name: TestTestId
Failed: 0 test(s), Passed: 1 test(s), Total: 1 test(s)
Name: TestThreadAPI
Failed: 0 test(s), Passed: 15 test(s), Total: 15 test(s)
Name: TestThreadExit
Failed: 0 test(s), Passed: 3 test(s), Total: 3 test(s)
Name: TestThreadJump
Failed: 0 test(s), Passed: 3 test(s), Total: 3 test(s)
Name: TestThreadSpecificBpPlusCondition
Failed: 0 test(s), Passed: 3 test(s), Total: 3 test(s)
Name: TestThreadSpecificBreakpoint
Failed: 0 test(s), Passed: 3 test(s), Total: 3 test(s)
Name: TestThreadStates
Failed: 0 test(s), Passed: 15 test(s), Total: 15 test(s)
Name: TestThreadStepOut
Failed: 0 test(s), Passed: 0 test(s), Total: 9 test(s)
Name: TestThreadStepping
Failed: 0 test(s), Passed: 3 test(s), Total: 3 test(s)
Name: TestTlsGlobals
Failed: 0 test(s), Passed: 3 test(s), Total: 3 test(s)
Name: TestTopLevelExprs
Failed: 0 test(s), Passed: 2 test(s), Total: 3 test(s)
Name: TestTsanBasic
Failed: 0 test(s), Passed: 3 test(s), Total: 3 test(s)
Name: TestTsanCPPGlobalLocation
Failed: 0 test(s), Passed: 3 test(s), Total: 3 test(s)
Name: TestTsanGlobalLocation
Failed: 0 test(s), Passed: 3 test(s), Total: 3 test(s)
Name: TestTsanMultiple
Failed: 0 test(s), Passed: 3 test(s), Total: 3 test(s)
Name: TestTsanSwift
Failed: 0 test(s), Passed: 0 test(s), Total: 3 test(s)
Name: TestTsanThreadLeak
Failed: 0 test(s), Passed: 3 test(s), Total: 3 test(s)
Name: TestTsanThreadNumbers
Failed: 0 test(s), Passed: 3 test(s), Total: 3 test(s)
Name: TestTypeCompletion
Failed: 0 test(s), Passed: 3 test(s), Total: 3 test(s)
Name: TestTypeList
Failed: 0 test(s), Passed: 3 test(s), Total: 3 test(s)
Name: TestTypeSummaryListArg
Failed: 0 test(s), Passed: 1 test(s), Total: 1 test(s)
Name: TestTypeSummaryListScript
Failed: 0 test(s), Passed: 3 test(s), Total: 3 test(s)
Name: TestUnicodeLiterals
Failed: 0 test(s), Passed: 9 test(s), Total: 9 test(s)
Name: TestUnionMembers
Failed: 0 test(s), Passed: 3 test(s), Total: 3 test(s)
Name: TestUniqueTypes
Failed: 0 test(s), Passed: 3 test(s), Total: 3 test(s)
Name: TestUnsignedTypes
Failed: 0 test(s), Passed: 3 test(s), Total: 3 test(s)
Name: TestUnwindExpression
Failed: 0 test(s), Passed: 3 test(s), Total: 3 test(s)
Name: TestUserFormatVsSummary
Failed: 0 test(s), Passed: 3 test(s), Total: 3 test(s)
Name: TestValueAPI
Failed: 0 test(s), Passed: 3 test(s), Total: 3 test(s)
Name: TestValueAPIEmptyClass
Failed: 0 test(s), Passed: 3 test(s), Total: 3 test(s)
Name: TestValueAPILinkedList
Failed: 0 test(s), Passed: 3 test(s), Total: 3 test(s)
Name: TestValueMD5Crash
Failed: 0 test(s), Passed: 3 test(s), Total: 3 test(s)
Name: TestValueObjectRecursion
Failed: 0 test(s), Passed: 3 test(s), Total: 3 test(s)
Name: TestValueOfVectorVariable
Failed: 0 test(s), Passed: 3 test(s), Total: 3 test(s)
Name: TestValueVarUpdate
Failed: 0 test(s), Passed: 3 test(s), Total: 3 test(s)
Name: TestVarInAggregateMisuse
Failed: 0 test(s), Passed: 3 test(s), Total: 3 test(s)
Name: TestVectorTypesFormatting
Failed: 0 test(s), Passed: 3 test(s), Total: 3 test(s)
Name: TestVirtual
Failed: 0 test(s), Passed: 3 test(s), Total: 3 test(s)
Name: TestWatchLocation
Failed: 0 test(s), Passed: 3 test(s), Total: 3 test(s)
Name: TestWatchLocationWithWatchSet
Failed: 3 test(s), Passed: 0 test(s), Total: 3 test(s)
Failed: TestWatchLocationWithWatchSet.WatchLocationUsingWatchpointSetTestCase.test_watchlocation_using_watchpoint_set_dwarf <https://ci.swift.org/job/oss-lldb-incremental-linux-ubuntu-16_04/2218/testReport/junit/TestWatchLocationWithWatchSet/WatchLocationUsingWatchpointSetTestCase/test_watchlocation_using_watchpoint_set_dwarf>
Failed: TestWatchLocationWithWatchSet.WatchLocationUsingWatchpointSetTestCase.test_watchlocation_using_watchpoint_set_dwo <https://ci.swift.org/job/oss-lldb-incremental-linux-ubuntu-16_04/2218/testReport/junit/TestWatchLocationWithWatchSet/WatchLocationUsingWatchpointSetTestCase/test_watchlocation_using_watchpoint_set_dwo>
Failed: TestWatchLocationWithWatchSet.WatchLocationUsingWatchpointSetTestCase.test_watchlocation_using_watchpoint_set_gmodules <https://ci.swift.org/job/oss-lldb-incremental-linux-ubuntu-16_04/2218/testReport/junit/TestWatchLocationWithWatchSet/WatchLocationUsingWatchpointSetTestCase/test_watchlocation_using_watchpoint_set_gmodules>
Name: TestWatchedVarHitWhenInScope
Failed: 0 test(s), Passed: 3 test(s), Total: 3 test(s)
Name: TestWatchpointCommandLLDB
Failed: 6 test(s), Passed: 0 test(s), Total: 6 test(s)
Failed: TestWatchpointCommandLLDB.WatchpointLLDBCommandTestCase.test_watchpoint_command_can_disable_a_watchpoint_dwarf <https://ci.swift.org/job/oss-lldb-incremental-linux-ubuntu-16_04/2218/testReport/junit/TestWatchpointCommandLLDB/WatchpointLLDBCommandTestCase/test_watchpoint_command_can_disable_a_watchpoint_dwarf>
Failed: TestWatchpointCommandLLDB.WatchpointLLDBCommandTestCase.test_watchpoint_command_can_disable_a_watchpoint_dwo <https://ci.swift.org/job/oss-lldb-incremental-linux-ubuntu-16_04/2218/testReport/junit/TestWatchpointCommandLLDB/WatchpointLLDBCommandTestCase/test_watchpoint_command_can_disable_a_watchpoint_dwo>
Failed: TestWatchpointCommandLLDB.WatchpointLLDBCommandTestCase.test_watchpoint_command_can_disable_a_watchpoint_gmodules <https://ci.swift.org/job/oss-lldb-incremental-linux-ubuntu-16_04/2218/testReport/junit/TestWatchpointCommandLLDB/WatchpointLLDBCommandTestCase/test_watchpoint_command_can_disable_a_watchpoint_gmodules>
Failed: TestWatchpointCommandLLDB.WatchpointLLDBCommandTestCase.test_watchpoint_command_dwarf <https://ci.swift.org/job/oss-lldb-incremental-linux-ubuntu-16_04/2218/testReport/junit/TestWatchpointCommandLLDB/WatchpointLLDBCommandTestCase/test_watchpoint_command_dwarf>
Failed: TestWatchpointCommandLLDB.WatchpointLLDBCommandTestCase.test_watchpoint_command_dwo <https://ci.swift.org/job/oss-lldb-incremental-linux-ubuntu-16_04/2218/testReport/junit/TestWatchpointCommandLLDB/WatchpointLLDBCommandTestCase/test_watchpoint_command_dwo>
Failed: TestWatchpointCommandLLDB.WatchpointLLDBCommandTestCase.test_watchpoint_command_gmodules <https://ci.swift.org/job/oss-lldb-incremental-linux-ubuntu-16_04/2218/testReport/junit/TestWatchpointCommandLLDB/WatchpointLLDBCommandTestCase/test_watchpoint_command_gmodules>
Name: TestWatchpointCommandPython
Failed: 6 test(s), Passed: 0 test(s), Total: 6 test(s)
Failed: TestWatchpointCommandPython.WatchpointPythonCommandTestCase.test_continue_in_watchpoint_command_dwarf <https://ci.swift.org/job/oss-lldb-incremental-linux-ubuntu-16_04/2218/testReport/junit/TestWatchpointCommandPython/WatchpointPythonCommandTestCase/test_continue_in_watchpoint_command_dwarf>
Failed: TestWatchpointCommandPython.WatchpointPythonCommandTestCase.test_continue_in_watchpoint_command_dwo <https://ci.swift.org/job/oss-lldb-incremental-linux-ubuntu-16_04/2218/testReport/junit/TestWatchpointCommandPython/WatchpointPythonCommandTestCase/test_continue_in_watchpoint_command_dwo>
Failed: TestWatchpointCommandPython.WatchpointPythonCommandTestCase.test_continue_in_watchpoint_command_gmodules <https://ci.swift.org/job/oss-lldb-incremental-linux-ubuntu-16_04/2218/testReport/junit/TestWatchpointCommandPython/WatchpointPythonCommandTestCase/test_continue_in_watchpoint_command_gmodules>
Failed: TestWatchpointCommandPython.WatchpointPythonCommandTestCase.test_watchpoint_command_dwarf <https://ci.swift.org/job/oss-lldb-incremental-linux-ubuntu-16_04/2218/testReport/junit/TestWatchpointCommandPython/WatchpointPythonCommandTestCase/test_watchpoint_command_dwarf>
Failed: TestWatchpointCommandPython.WatchpointPythonCommandTestCase.test_watchpoint_command_dwo <https://ci.swift.org/job/oss-lldb-incremental-linux-ubuntu-16_04/2218/testReport/junit/TestWatchpointCommandPython/WatchpointPythonCommandTestCase/test_watchpoint_command_dwo>
Failed: TestWatchpointCommandPython.WatchpointPythonCommandTestCase.test_watchpoint_command_gmodules <https://ci.swift.org/job/oss-lldb-incremental-linux-ubuntu-16_04/2218/testReport/junit/TestWatchpointCommandPython/WatchpointPythonCommandTestCase/test_watchpoint_command_gmodules>
Name: TestWatchpointCommands
Failed: 12 test(s), Passed: 3 test(s), Total: 15 test(s)
Failed: TestWatchpointCommands.WatchpointCommandsTestCase.test_rw_disable_after_first_stop_dwarf <https://ci.swift.org/job/oss-lldb-incremental-linux-ubuntu-16_04/2218/testReport/junit/TestWatchpointCommands/WatchpointCommandsTestCase/test_rw_disable_after_first_stop_dwarf>
Failed: TestWatchpointCommands.WatchpointCommandsTestCase.test_rw_disable_after_first_stop_dwo <https://ci.swift.org/job/oss-lldb-incremental-linux-ubuntu-16_04/2218/testReport/junit/TestWatchpointCommands/WatchpointCommandsTestCase/test_rw_disable_after_first_stop_dwo>
Failed: TestWatchpointCommands.WatchpointCommandsTestCase.test_rw_disable_after_first_stop_gmodules <https://ci.swift.org/job/oss-lldb-incremental-linux-ubuntu-16_04/2218/testReport/junit/TestWatchpointCommands/WatchpointCommandsTestCase/test_rw_disable_after_first_stop_gmodules>
Failed: TestWatchpointCommands.WatchpointCommandsTestCase.test_rw_disable_then_enable_dwarf <https://ci.swift.org/job/oss-lldb-incremental-linux-ubuntu-16_04/2218/testReport/junit/TestWatchpointCommands/WatchpointCommandsTestCase/test_rw_disable_then_enable_dwarf>
Failed: TestWatchpointCommands.WatchpointCommandsTestCase.test_rw_disable_then_enable_dwo <https://ci.swift.org/job/oss-lldb-incremental-linux-ubuntu-16_04/2218/testReport/junit/TestWatchpointCommands/WatchpointCommandsTestCase/test_rw_disable_then_enable_dwo>
Failed: TestWatchpointCommands.WatchpointCommandsTestCase.test_rw_disable_then_enable_gmodules <https://ci.swift.org/job/oss-lldb-incremental-linux-ubuntu-16_04/2218/testReport/junit/TestWatchpointCommands/WatchpointCommandsTestCase/test_rw_disable_then_enable_gmodules>
Failed: TestWatchpointCommands.WatchpointCommandsTestCase.test_rw_watchpoint_dwarf <https://ci.swift.org/job/oss-lldb-incremental-linux-ubuntu-16_04/2218/testReport/junit/TestWatchpointCommands/WatchpointCommandsTestCase/test_rw_watchpoint_dwarf>
Failed: TestWatchpointCommands.WatchpointCommandsTestCase.test_rw_watchpoint_dwo <https://ci.swift.org/job/oss-lldb-incremental-linux-ubuntu-16_04/2218/testReport/junit/TestWatchpointCommands/WatchpointCommandsTestCase/test_rw_watchpoint_dwo>
Failed: TestWatchpointCommands.WatchpointCommandsTestCase.test_rw_watchpoint_gmodules <https://ci.swift.org/job/oss-lldb-incremental-linux-ubuntu-16_04/2218/testReport/junit/TestWatchpointCommands/WatchpointCommandsTestCase/test_rw_watchpoint_gmodules>
Failed: TestWatchpointCommands.WatchpointCommandsTestCase.test_rw_watchpoint_set_ignore_count_dwarf <https://ci.swift.org/job/oss-lldb-incremental-linux-ubuntu-16_04/2218/testReport/junit/TestWatchpointCommands/WatchpointCommandsTestCase/test_rw_watchpoint_set_ignore_count_dwarf>
Failed: TestWatchpointCommands.WatchpointCommandsTestCase.test_rw_watchpoint_set_ignore_count_dwo <https://ci.swift.org/job/oss-lldb-incremental-linux-ubuntu-16_04/2218/testReport/junit/TestWatchpointCommands/WatchpointCommandsTestCase/test_rw_watchpoint_set_ignore_count_dwo>
Failed: TestWatchpointCommands.WatchpointCommandsTestCase.test_rw_watchpoint_set_ignore_count_gmodules <https://ci.swift.org/job/oss-lldb-incremental-linux-ubuntu-16_04/2218/testReport/junit/TestWatchpointCommands/WatchpointCommandsTestCase/test_rw_watchpoint_set_ignore_count_gmodules>
Name: TestWatchpointConditionAPI
Failed: 3 test(s), Passed: 0 test(s), Total: 3 test(s)
Failed: TestWatchpointConditionAPI.WatchpointConditionAPITestCase.test_watchpoint_cond_api_dwarf <https://ci.swift.org/job/oss-lldb-incremental-linux-ubuntu-16_04/2218/testReport/junit/TestWatchpointConditionAPI/WatchpointConditionAPITestCase/test_watchpoint_cond_api_dwarf>
Failed: TestWatchpointConditionAPI.WatchpointConditionAPITestCase.test_watchpoint_cond_api_dwo <https://ci.swift.org/job/oss-lldb-incremental-linux-ubuntu-16_04/2218/testReport/junit/TestWatchpointConditionAPI/WatchpointConditionAPITestCase/test_watchpoint_cond_api_dwo>
Failed: TestWatchpointConditionAPI.WatchpointConditionAPITestCase.test_watchpoint_cond_api_gmodules <https://ci.swift.org/job/oss-lldb-incremental-linux-ubuntu-16_04/2218/testReport/junit/TestWatchpointConditionAPI/WatchpointConditionAPITestCase/test_watchpoint_cond_api_gmodules>
Name: TestWatchpointConditionCmd
Failed: 3 test(s), Passed: 0 test(s), Total: 3 test(s)
Failed: TestWatchpointConditionCmd.WatchpointConditionCmdTestCase.test_watchpoint_cond_dwarf <https://ci.swift.org/job/oss-lldb-incremental-linux-ubuntu-16_04/2218/testReport/junit/TestWatchpointConditionCmd/WatchpointConditionCmdTestCase/test_watchpoint_cond_dwarf>
Failed: TestWatchpointConditionCmd.WatchpointConditionCmdTestCase.test_watchpoint_cond_dwo <https://ci.swift.org/job/oss-lldb-incremental-linux-ubuntu-16_04/2218/testReport/junit/TestWatchpointConditionCmd/WatchpointConditionCmdTestCase/test_watchpoint_cond_dwo>
Failed: TestWatchpointConditionCmd.WatchpointConditionCmdTestCase.test_watchpoint_cond_gmodules <https://ci.swift.org/job/oss-lldb-incremental-linux-ubuntu-16_04/2218/testReport/junit/TestWatchpointConditionCmd/WatchpointConditionCmdTestCase/test_watchpoint_cond_gmodules>
Name: TestWatchpointDisable
Failed: 3 test(s), Passed: 3 test(s), Total: 6 test(s)
Failed: TestWatchpointDisable.TestWatchpointSetEnable.test_disable_enable_works_dwarf <https://ci.swift.org/job/oss-lldb-incremental-linux-ubuntu-16_04/2218/testReport/junit/TestWatchpointDisable/TestWatchpointSetEnable/test_disable_enable_works_dwarf>
Failed: TestWatchpointDisable.TestWatchpointSetEnable.test_disable_enable_works_dwo <https://ci.swift.org/job/oss-lldb-incremental-linux-ubuntu-16_04/2218/testReport/junit/TestWatchpointDisable/TestWatchpointSetEnable/test_disable_enable_works_dwo>
Failed: TestWatchpointDisable.TestWatchpointSetEnable.test_disable_enable_works_gmodules <https://ci.swift.org/job/oss-lldb-incremental-linux-ubuntu-16_04/2218/testReport/junit/TestWatchpointDisable/TestWatchpointSetEnable/test_disable_enable_works_gmodules>
Name: TestWatchpointEvents
Failed: 0 test(s), Passed: 3 test(s), Total: 3 test(s)
Name: TestWatchpointIgnoreCount
Failed: 3 test(s), Passed: 0 test(s), Total: 3 test(s)
Failed: TestWatchpointIgnoreCount.WatchpointIgnoreCountTestCase.test_set_watch_ignore_count_dwarf <https://ci.swift.org/job/oss-lldb-incremental-linux-ubuntu-16_04/2218/testReport/junit/TestWatchpointIgnoreCount/WatchpointIgnoreCountTestCase/test_set_watch_ignore_count_dwarf>
Failed: TestWatchpointIgnoreCount.WatchpointIgnoreCountTestCase.test_set_watch_ignore_count_dwo <https://ci.swift.org/job/oss-lldb-incremental-linux-ubuntu-16_04/2218/testReport/junit/TestWatchpointIgnoreCount/WatchpointIgnoreCountTestCase/test_set_watch_ignore_count_dwo>
Failed: TestWatchpointIgnoreCount.WatchpointIgnoreCountTestCase.test_set_watch_ignore_count_gmodules <https://ci.swift.org/job/oss-lldb-incremental-linux-ubuntu-16_04/2218/testReport/junit/TestWatchpointIgnoreCount/WatchpointIgnoreCountTestCase/test_set_watch_ignore_count_gmodules>
Name: TestWatchpointIter
Failed: 3 test(s), Passed: 0 test(s), Total: 3 test(s)
Failed: TestWatchpointIter.WatchpointIteratorTestCase.test_watch_iter_dwarf <https://ci.swift.org/job/oss-lldb-incremental-linux-ubuntu-16_04/2218/testReport/junit/TestWatchpointIter/WatchpointIteratorTestCase/test_watch_iter_dwarf>
Failed: TestWatchpointIter.WatchpointIteratorTestCase.test_watch_iter_dwo <https://ci.swift.org/job/oss-lldb-incremental-linux-ubuntu-16_04/2218/testReport/junit/TestWatchpointIter/WatchpointIteratorTestCase/test_watch_iter_dwo>
Failed: TestWatchpointIter.WatchpointIteratorTestCase.test_watch_iter_gmodules <https://ci.swift.org/job/oss-lldb-incremental-linux-ubuntu-16_04/2218/testReport/junit/TestWatchpointIter/WatchpointIteratorTestCase/test_watch_iter_gmodules>
Name: TestWatchpointMultipleSlots
Failed: 0 test(s), Passed: 0 test(s), Total: 1 test(s)
Name: TestWatchpointMultipleThreads
Failed: 3 test(s), Passed: 3 test(s), Total: 6 test(s)
Failed: TestWatchpointMultipleThreads.WatchpointForMultipleThreadsTestCase.test_watchpoint_multiple_threads_dwarf <https://ci.swift.org/job/oss-lldb-incremental-linux-ubuntu-16_04/2218/testReport/junit/TestWatchpointMultipleThreads/WatchpointForMultipleThreadsTestCase/test_watchpoint_multiple_threads_dwarf>
Failed: TestWatchpointMultipleThreads.WatchpointForMultipleThreadsTestCase.test_watchpoint_multiple_threads_dwo <https://ci.swift.org/job/oss-lldb-incremental-linux-ubuntu-16_04/2218/testReport/junit/TestWatchpointMultipleThreads/WatchpointForMultipleThreadsTestCase/test_watchpoint_multiple_threads_dwo>
Failed: TestWatchpointMultipleThreads.WatchpointForMultipleThreadsTestCase.test_watchpoint_multiple_threads_gmodules <https://ci.swift.org/job/oss-lldb-incremental-linux-ubuntu-16_04/2218/testReport/junit/TestWatchpointMultipleThreads/WatchpointForMultipleThreadsTestCase/test_watchpoint_multiple_threads_gmodules>
Name: TestWatchpointSetErrorCases
Failed: 0 test(s), Passed: 3 test(s), Total: 3 test(s)
Name: TestWatchpointSizes
Failed: 3 test(s), Passed: 0 test(s), Total: 3 test(s)
Failed: TestWatchpointSizes.WatchpointSizeTestCase.test_byte_size_watchpoints_with_byte_selection <https://ci.swift.org/job/oss-lldb-incremental-linux-ubuntu-16_04/2218/testReport/junit/TestWatchpointSizes/WatchpointSizeTestCase/test_byte_size_watchpoints_with_byte_selection>
Failed: TestWatchpointSizes.WatchpointSizeTestCase.test_four_byte_watchpoints_with_dword_selection <https://ci.swift.org/job/oss-lldb-incremental-linux-ubuntu-16_04/2218/testReport/junit/TestWatchpointSizes/WatchpointSizeTestCase/test_four_byte_watchpoints_with_dword_selection>
Failed: TestWatchpointSizes.WatchpointSizeTestCase.test_two_byte_watchpoints_with_word_selection <https://ci.swift.org/job/oss-lldb-incremental-linux-ubuntu-16_04/2218/testReport/junit/TestWatchpointSizes/WatchpointSizeTestCase/test_two_byte_watchpoints_with_word_selection>
Name: TestWithLimitDebugInfo
Failed: 0 test(s), Passed: 1 test(s), Total: 3 test(s)
Name: TestWithModuleDebugging
Failed: 0 test(s), Passed: 1 test(s), Total: 1 test(s)
Name: TestWow64MiniDump
Failed: 0 test(s), Passed: 3 test(s), Total: 3 test(s)
Name: TestYMMRegister
Failed: 0 test(s), Passed: 3 test(s), Total: 3 test(s)
Name: Testtypedef
Failed: 0 test(s), Passed: 3 test(s), Total: 3 test(s)
Name: lldbsuite.test.lldbtest
Failed: 21 test(s), Passed: 108 test(s), Total: 159 test(s)
Failed: lldbsuite.test.lldbtest.TestSwiftGenericStructDebugInfoGenericApply.test_with_dwarf <https://ci.swift.org/job/oss-lldb-incremental-linux-ubuntu-16_04/2218/testReport/junit/lldbsuite.test.lldbtest/TestSwiftGenericStructDebugInfoGenericApply/test_with_dwarf>
Failed: lldbsuite.test.lldbtest.TestSwiftGenericStructDebugInfoGenericApply.test_with_dwo <https://ci.swift.org/job/oss-lldb-incremental-linux-ubuntu-16_04/2218/testReport/junit/lldbsuite.test.lldbtest/TestSwiftGenericStructDebugInfoGenericApply/test_with_dwo>
Failed: lldbsuite.test.lldbtest.TestSwiftGenericStructDebugInfoGenericApply.test_with_gmodules <https://ci.swift.org/job/oss-lldb-incremental-linux-ubuntu-16_04/2218/testReport/junit/lldbsuite.test.lldbtest/TestSwiftGenericStructDebugInfoGenericApply/test_with_gmodules>
Failed: lldbsuite.test.lldbtest.TestSwiftGenericStructDebugInfoGenericArray.test_with_dwarf <https://ci.swift.org/job/oss-lldb-incremental-linux-ubuntu-16_04/2218/testReport/junit/lldbsuite.test.lldbtest/TestSwiftGenericStructDebugInfoGenericArray/test_with_dwarf>
Failed: lldbsuite.test.lldbtest.TestSwiftGenericStructDebugInfoGenericArray.test_with_dwo <https://ci.swift.org/job/oss-lldb-incremental-linux-ubuntu-16_04/2218/testReport/junit/lldbsuite.test.lldbtest/TestSwiftGenericStructDebugInfoGenericArray/test_with_dwo>
Failed: lldbsuite.test.lldbtest.TestSwiftGenericStructDebugInfoGenericArray.test_with_gmodules <https://ci.swift.org/job/oss-lldb-incremental-linux-ubuntu-16_04/2218/testReport/junit/lldbsuite.test.lldbtest/TestSwiftGenericStructDebugInfoGenericArray/test_with_gmodules>
Failed: lldbsuite.test.lldbtest.TestSwiftGenericStructDebugInfoGenericFlatMap.test_with_dwarf <https://ci.swift.org/job/oss-lldb-incremental-linux-ubuntu-16_04/2218/testReport/junit/lldbsuite.test.lldbtest/TestSwiftGenericStructDebugInfoGenericFlatMap/test_with_dwarf>
Failed: lldbsuite.test.lldbtest.TestSwiftGenericStructDebugInfoGenericFlatMap.test_with_dwo <https://ci.swift.org/job/oss-lldb-incremental-linux-ubuntu-16_04/2218/testReport/junit/lldbsuite.test.lldbtest/TestSwiftGenericStructDebugInfoGenericFlatMap/test_with_dwo>
Failed: lldbsuite.test.lldbtest.TestSwiftGenericStructDebugInfoGenericFlatMap.test_with_gmodules <https://ci.swift.org/job/oss-lldb-incremental-linux-ubuntu-16_04/2218/testReport/junit/lldbsuite.test.lldbtest/TestSwiftGenericStructDebugInfoGenericFlatMap/test_with_gmodules>
Failed: lldbsuite.test.lldbtest.TestSwiftPOConflictedTypes.test_with_dwarf <https://ci.swift.org/job/oss-lldb-incremental-linux-ubuntu-16_04/2218/testReport/junit/lldbsuite.test.lldbtest/TestSwiftPOConflictedTypes/test_with_dwarf>
Failed: lldbsuite.test.lldbtest.TestSwiftPOConflictedTypes.test_with_dwo <https://ci.swift.org/job/oss-lldb-incremental-linux-ubuntu-16_04/2218/testReport/junit/lldbsuite.test.lldbtest/TestSwiftPOConflictedTypes/test_with_dwo>
Failed: lldbsuite.test.lldbtest.TestSwiftPOConflictedTypes.test_with_gmodules <https://ci.swift.org/job/oss-lldb-incremental-linux-ubuntu-16_04/2218/testReport/junit/lldbsuite.test.lldbtest/TestSwiftPOConflictedTypes/test_with_gmodules>
Failed: lldbsuite.test.lldbtest.TestSwiftPORecursiveBehavior.test_with_dwarf <https://ci.swift.org/job/oss-lldb-incremental-linux-ubuntu-16_04/2218/testReport/junit/lldbsuite.test.lldbtest/TestSwiftPORecursiveBehavior/test_with_dwarf>
Failed: lldbsuite.test.lldbtest.TestSwiftPORecursiveBehavior.test_with_dwo <https://ci.swift.org/job/oss-lldb-incremental-linux-ubuntu-16_04/2218/testReport/junit/lldbsuite.test.lldbtest/TestSwiftPORecursiveBehavior/test_with_dwo>
Failed: lldbsuite.test.lldbtest.TestSwiftPORecursiveBehavior.test_with_gmodules <https://ci.swift.org/job/oss-lldb-incremental-linux-ubuntu-16_04/2218/testReport/junit/lldbsuite.test.lldbtest/TestSwiftPORecursiveBehavior/test_with_gmodules>
Failed: lldbsuite.test.lldbtest.TestSwiftPORefTypes.test_with_dwarf <https://ci.swift.org/job/oss-lldb-incremental-linux-ubuntu-16_04/2218/testReport/junit/lldbsuite.test.lldbtest/TestSwiftPORefTypes/test_with_dwarf>
Failed: lldbsuite.test.lldbtest.TestSwiftPORefTypes.test_with_dwo <https://ci.swift.org/job/oss-lldb-incremental-linux-ubuntu-16_04/2218/testReport/junit/lldbsuite.test.lldbtest/TestSwiftPORefTypes/test_with_dwo>
Failed: lldbsuite.test.lldbtest.TestSwiftPORefTypes.test_with_gmodules <https://ci.swift.org/job/oss-lldb-incremental-linux-ubuntu-16_04/2218/testReport/junit/lldbsuite.test.lldbtest/TestSwiftPORefTypes/test_with_gmodules>
Failed: lldbsuite.test.lldbtest.TestSwiftPOValTypes.test_with_dwarf <https://ci.swift.org/job/oss-lldb-incremental-linux-ubuntu-16_04/2218/testReport/junit/lldbsuite.test.lldbtest/TestSwiftPOValTypes/test_with_dwarf>
Failed: lldbsuite.test.lldbtest.TestSwiftPOValTypes.test_with_dwo <https://ci.swift.org/job/oss-lldb-incremental-linux-ubuntu-16_04/2218/testReport/junit/lldbsuite.test.lldbtest/TestSwiftPOValTypes/test_with_dwo>
Failed: lldbsuite.test.lldbtest.TestSwiftPOValTypes.test_with_gmodules <https://ci.swift.org/job/oss-lldb-incremental-linux-ubuntu-16_04/2218/testReport/junit/lldbsuite.test.lldbtest/TestSwiftPOValTypes/test_with_gmodules>

Changes

Commit e494e3fbfee10a7e8160dad5fa7b5b9317ad9fc7 by Michael Gottesman:
[lexicon] Define irrefutable and refutable pattern in the Lexicon.

edit: docs/Lexicon.rst

Commit 915b3198107fb1f0c200e433227dcca7c9943343 by Andrew Trick:
[AccessEnforce] must handle `undef` before diagnostics.

edit: lib/SILOptimizer/Mandatory/AccessEnforcementSelection.cpp
edit: test/SILOptimizer/access_enforcement_selection.swift

Commit 081f2396e513f3d45aab2944019ec316cda32130 by Michael Gottesman:
[silgen] Refactor emitLocalVariableWithCleanup to take an optional

edit: lib/SILGen/SILGenConstructor.cpp
edit: lib/SILGen/SILGenDecl.cpp
edit: lib/SILGen/SILGenFunction.h

Commit 6846b89e9099a75eebe7c817d3dc7a21579b7688 by Michael Gottesman:
[silgen] Instead of creating our own mark_uninitialized, use the new

edit: lib/SILGen/SILGenConstructor.cpp

Commit 63475950e5ce6a54a4e50596820ca8c9a82131a2 by Bruno Cardoso Lopes:
[modules] Delay calling DeclMustBeEmitted until it's safe.

edit: lib/Serialization/ASTReader.cpp
edit: include/clang/Serialization/ASTReader.h
edit: lib/Serialization/ASTReaderDecl.cpp


(Jim Ingham) #2

Note that all the watchpoint tests started failing. Todd and Mishal chased down similar problems in the past. All watchpoint tests would start failing on the IBM ubuntu boxes, even though the same lldb sources on some normal Ubuntu box of the same version succeeded. As I understood it, this was caused by some configuration change on the box. Makes sense that data watchpoint registers would be something you would NOT allow access to in server type configurations, so that this should get turned off isn't all that surprising.

Sometimes a reboot cleared it up, but I think sometimes Todd had to do more work to get these tests running again.

Jim

···

On Apr 14, 2017, at 9:18 PM, Andrew Trick via swift-lldb-dev <swift-lldb-dev@swift.org> wrote:

File "/home/buildnode/disk2/workspace/oss-lldb-incremental-linux-ubuntu-16_04/lldb/packages/Python/lldbsuite/test/python_api/watchpoint/condition/TestWatchpointConditionAPI.py", line 99, in test_watchpoint_cond_api
    self.assertTrue(thread, "The thread stopped due to watchpoint")
AssertionError: None is not True : The thread stopped due to watchpoint

No idea what this is. The report does not list any lldb commits.
-Andy

On Apr 14, 2017, at 8:47 PM, no-reply@swift.org wrote:

New issue found!

[FAILURE] oss-lldb-incremental-linux-ubuntu-16_04 [#2218]

Build URL: https://ci.swift.org/job/oss-lldb-incremental-linux-ubuntu-16_04/2218/
Project: oss-lldb-incremental-linux-ubuntu-16_04
Date of build: Fri, 14 Apr 2017 19:25:18 -0700
Build duration: 1 hr 22 min
Identified problems:

  • Regression test failed: This build failed because a regression test in the test suite FAILed. Below is a list of all errors:
    • Indication 1
Tests:

Name: Test-rdar-12481949
Failed: 0 test(s), Passed: 3 test(s), Total: 3 test(s)
Name: Test-rdar-9974002
Failed: 0 test(s), Passed: 3 test(s), Total: 3 test(s)
Name: Test11588
Failed: 0 test(s), Passed: 3 test(s), Total: 3 test(s)
Name: Test8638051
Failed: 0 test(s), Passed: 3 test(s), Total: 3 test(s)
Name: TestAbbreviations
Failed: 0 test(s), Passed: 1 test(s), Total: 1 test(s)
Name: TestAddressBreakpoints
Failed: 0 test(s), Passed: 1 test(s), Total: 1 test(s)
Name: TestAnonymous
Failed: 0 test(s), Passed: 21 test(s), Total: 21 test(s)
Name: TestApropos
Failed: 0 test(s), Passed: 1 test(s), Total: 1 test(s)
Name: TestAproposWithProcess
Failed: 0 test(s), Passed: 3 test(s), Total: 3 test(s)
Name: TestArrayTypes
Failed: 0 test(s), Passed: 6 test(s), Total: 6 test(s)
Name: TestAsanSwift
Failed: 0 test(s), Passed: 0 test(s), Total: 3 test(s)
Name: TestAttachDenied
Failed: 0 test(s), Passed: 3 test(s), Total: 3 test(s)
Name: TestAttachResume
Failed: 0 test(s), Passed: 3 test(s), Total: 3 test(s)
Name: TestAvoidBreakpointInDelaySlot
Failed: 0 test(s), Passed: 0 test(s), Total: 3 test(s)
Name: TestBSDArchives
Failed: 0 test(s), Passed: 3 test(s), Total: 3 test(s)
Name: TestBackticksWithoutATarget
Failed: 0 test(s), Passed: 1 test(s), Total: 1 test(s)
Name: TestBacktraceAll
Failed: 0 test(s), Passed: 3 test(s), Total: 3 test(s)
Name: TestBadAddressBreakpoints
Failed: 0 test(s), Passed: 1 test(s), Total: 1 test(s)
Name: TestBatchMode
Failed: 0 test(s), Passed: 9 test(s), Total: 9 test(s)
Name: TestBitfields
Failed: 0 test(s), Passed: 6 test(s), Total: 6 test(s)
Name: TestBoundViolation
Failed: 0 test(s), Passed: 0 test(s), Total: 3 test(s)
Name: TestBreakAfterJoin
Failed: 0 test(s), Passed: 3 test(s), Total: 3 test(s)
Name: TestBreakpointAPI
Failed: 0 test(s), Passed: 3 test(s), Total: 3 test(s)
Name: TestBreakpointCaseSensitivity
Failed: 0 test(s), Passed: 3 test(s), Total: 6 test(s)
Name: TestBreakpointCommand
Failed: 0 test(s), Passed: 3 test(s), Total: 3 test(s)
Name: TestBreakpointCommandsFromPython
Failed: 0 test(s), Passed: 3 test(s), Total: 3 test(s)
Name: TestBreakpointConditions
Failed: 0 test(s), Passed: 12 test(s), Total: 12 test(s)
Name: TestBreakpointIDs
Failed: 0 test(s), Passed: 3 test(s), Total: 3 test(s)
Name: TestBreakpointIgnoreCount
Failed: 0 test(s), Passed: 6 test(s), Total: 6 test(s)
Name: TestBreakpointLanguage
Failed: 0 test(s), Passed: 6 test(s), Total: 6 test(s)
Name: TestBreakpointLocations
Failed: 0 test(s), Passed: 3 test(s), Total: 3 test(s)
Name: TestBreakpointNames
Failed: 0 test(s), Passed: 9 test(s), Total: 9 test(s)
Name: TestBreakpointOptions
Failed: 0 test(s), Passed: 3 test(s), Total: 3 test(s)
Name: TestBreakpointSerialization
Failed: 0 test(s), Passed: 15 test(s), Total: 15 test(s)
Name: TestBreakpointSetRestart
Failed: 0 test(s), Passed: 3 test(s), Total: 3 test(s)
Name: TestBreakpointsWithNoTargets
Failed: 0 test(s), Passed: 3 test(s), Total: 3 test(s)
Name: TestBuiltinTrap
Failed: 0 test(s), Passed: 3 test(s), Total: 3 test(s)
Name: TestBulkyEnumsVariables
Failed: 0 test(s), Passed: 3 test(s), Total: 3 test(s)
Name: TestCInlines
Failed: 0 test(s), Passed: 3 test(s), Total: 3 test(s)
Name: TestCModules
Failed: 0 test(s), Passed: 3 test(s), Total: 3 test(s)
Name: TestCPP11EnumTypes
Failed: 0 test(s), Passed: 24 test(s), Total: 24 test(s)
Name: TestCPPAuto
Failed: 0 test(s), Passed: 3 test(s), Total: 3 test(s)
Name: TestCPPBool
Failed: 0 test(s), Passed: 3 test(s), Total: 3 test(s)
Name: TestCPPBreakpointCommands
Failed: 0 test(s), Passed: 3 test(s), Total: 3 test(s)
Name: TestCPPBreakpointLocations
Failed: 0 test(s), Passed: 6 test(s), Total: 6 test(s)
Name: TestCPPExceptionBreakpoint
Failed: 0 test(s), Passed: 3 test(s), Total: 3 test(s)
Name: TestCPPExceptionBreakpoints
Failed: 0 test(s), Passed: 3 test(s), Total: 3 test(s)
Name: TestCPPStaticMembers
Failed: 0 test(s), Passed: 3 test(s), Total: 3 test(s)
Name: TestCPPStaticMethods
Failed: 0 test(s), Passed: 3 test(s), Total: 3 test(s)
Name: TestCPPThis
Failed: 0 test(s), Passed: 3 test(s), Total: 3 test(s)
Name: TestCStrings
Failed: 0 test(s), Passed: 3 test(s), Total: 3 test(s)
Name: TestCalculatorMode
Failed: 0 test(s), Passed: 3 test(s), Total: 3 test(s)
Name: TestCallCPPFunction
Failed: 0 test(s), Passed: 3 test(s), Total: 3 test(s)
Name: TestCallStdStringFunction
Failed: 0 test(s), Passed: 3 test(s), Total: 3 test(s)
Name: TestCallStopAndContinue
Failed: 0 test(s), Passed: 3 test(s), Total: 3 test(s)
Name: TestCallThatRestarts
Failed: 0 test(s), Passed: 3 test(s), Total: 3 test(s)
Name: TestCallUserAnonTypedef
Failed: 0 test(s), Passed: 3 test(s), Total: 3 test(s)
Name: TestCallUserDefinedFunction
Failed: 0 test(s), Passed: 3 test(s), Total: 3 test(s)
Name: TestCallWithTimeout
Failed: 0 test(s), Passed: 3 test(s), Total: 3 test(s)
Name: TestChangeProcessGroup
Failed: 0 test(s), Passed: 1 test(s), Total: 1 test(s)
Name: TestChangeValueAPI
Failed: 0 test(s), Passed: 3 test(s), Total: 3 test(s)
Name: TestChar1632T
Failed: 0 test(s), Passed: 3 test(s), Total: 3 test(s)
Name: TestClassTypes
Failed: 0 test(s), Passed: 12 test(s), Total: 12 test(s)
Name: TestClassTypesDisassembly
Failed: 0 test(s), Passed: 6 test(s), Total: 6 test(s)
Name: TestCommandHistory
Failed: 0 test(s), Passed: 1 test(s), Total: 1 test(s)
Name: TestCommandInterpreterAPI
Failed: 0 test(s), Passed: 3 test(s), Total: 3 test(s)
Name: TestCommandRegex
Failed: 0 test(s), Passed: 1 test(s), Total: 1 test(s)
Name: TestCommandScript
Failed: 0 test(s), Passed: 3 test(s), Total: 3 test(s)
Name: TestCommandScriptAlias
Failed: 0 test(s), Passed: 3 test(s), Total: 3 test(s)
Name: TestCommandScriptImmediateOutput
Failed: 0 test(s), Passed: 2 test(s), Total: 2 test(s)
Name: TestCommandSource
Failed: 0 test(s), Passed: 1 test(s), Total: 1 test(s)
Name: TestCommonShortSpellings
Failed: 0 test(s), Passed: 1 test(s), Total: 1 test(s)
Name: TestCompDirSymLink
Failed: 0 test(s), Passed: 9 test(s), Total: 9 test(s)
Name: TestCompletion
Failed: 0 test(s), Passed: 34 test(s), Total: 34 test(s)
Name: TestConcurrentBreakpointDelayBreakpointOneSignal
Failed: 0 test(s), Passed: 1 test(s), Total: 1 test(s)
Name: TestConcurrentBreakpointOneDelayBreakpointThreads
Failed: 0 test(s), Passed: 1 test(s), Total: 1 test(s)
Name: TestConcurrentBreakpointsDelayedBreakpointOneWatchpoint
Failed: 1 test(s), Passed: 0 test(s), Total: 1 test(s)
  • Failed: TestConcurrentBreakpointsDelayedBreakpointOneWatchpoint.ConcurrentBreakpointsDelayedBreakpointOneWatchpoint.test
Name: TestConcurrentCrashWithBreak
Failed: 0 test(s), Passed: 1 test(s), Total: 1 test(s)
Name: TestConcurrentCrashWithSignal
Failed: 0 test(s), Passed: 1 test(s), Total: 1 test(s)
Name: TestConcurrentCrashWithWatchpoint
Failed: 0 test(s), Passed: 1 test(s), Total: 1 test(s)
Name: TestConcurrentCrashWithWatchpointBreakpointSignal
Failed: 1 test(s), Passed: 0 test(s), Total: 1 test(s)
  • Failed: TestConcurrentCrashWithWatchpointBreakpointSignal.ConcurrentCrashWithWatchpointBreakpointSignal.test
Name: TestConcurrentDelaySignalBreak
Failed: 0 test(s), Passed: 1 test(s), Total: 1 test(s)
Name: TestConcurrentDelaySignalWatch
Failed: 1 test(s), Passed: 0 test(s), Total: 1 test(s)
  • Failed: TestConcurrentDelaySignalWatch.ConcurrentDelaySignalWatch.test
Name: TestConcurrentDelayWatchBreak
Failed: 1 test(s), Passed: 0 test(s), Total: 1 test(s)
  • Failed: TestConcurrentDelayWatchBreak.ConcurrentDelayWatchBreak.test
Name: TestConcurrentDelayedCrashWithBreakpointSignal
Failed: 0 test(s), Passed: 1 test(s), Total: 1 test(s)
Name: TestConcurrentDelayedCrashWithBreakpointWatchpoint
Failed: 1 test(s), Passed: 0 test(s), Total: 1 test(s)
  • Failed: TestConcurrentDelayedCrashWithBreakpointWatchpoint.ConcurrentDelayedCrashWithBreakpointWatchpoint.test
Name: TestConcurrentNWatchNBreak
Failed: 1 test(s), Passed: 0 test(s), Total: 1 test(s)
  • Failed: TestConcurrentNWatchNBreak.ConcurrentNWatchNBreak.test
Name: TestConcurrentSignalBreak
Failed: 0 test(s), Passed: 1 test(s), Total: 1 test(s)
Name: TestConcurrentSignalDelayBreak
Failed: 0 test(s), Passed: 1 test(s), Total: 1 test(s)
Name: TestConcurrentSignalDelayWatch
Failed: 1 test(s), Passed: 0 test(s), Total: 1 test(s)
  • Failed: TestConcurrentSignalDelayWatch.ConcurrentSignalDelayWatch.test
Name: TestConcurrentSignalNWatchNBreak
Failed: 1 test(s), Passed: 0 test(s), Total: 1 test(s)
  • Failed: TestConcurrentSignalNWatchNBreak.ConcurrentSignalNWatchNBreak.test
Name: TestConcurrentSignalWatch
Failed: 1 test(s), Passed: 0 test(s), Total: 1 test(s)
  • Failed: TestConcurrentSignalWatch.ConcurrentSignalWatch.test
Name: TestConcurrentSignalWatchBreak
Failed: 1 test(s), Passed: 0 test(s), Total: 1 test(s)
  • Failed: TestConcurrentSignalWatchBreak.ConcurrentSignalWatchBreak.test
Name: TestConcurrentTwoBreakpointThreads
Failed: 0 test(s), Passed: 1 test(s), Total: 1 test(s)
Name: TestConcurrentTwoBreakpointsOneDelaySignal
Failed: 0 test(s), Passed: 1 test(s), Total: 1 test(s)
Name: TestConcurrentTwoBreakpointsOneSignal
Failed: 0 test(s), Passed: 1 test(s), Total: 1 test(s)
Name: TestConcurrentTwoBreakpointsOneWatchpoint
Failed: 1 test(s), Passed: 0 test(s), Total: 1 test(s)
  • Failed: TestConcurrentTwoBreakpointsOneWatchpoint.ConcurrentTwoBreakpointsOneWatchpoint.test
Name: TestConcurrentTwoWatchpointThreads
Failed: 1 test(s), Passed: 0 test(s), Total: 1 test(s)
  • Failed: TestConcurrentTwoWatchpointThreads.ConcurrentTwoWatchpointThreads.test
Name: TestConcurrentTwoWatchpointsOneBreakpoint
Failed: 1 test(s), Passed: 0 test(s), Total: 1 test(s)
  • Failed: TestConcurrentTwoWatchpointsOneBreakpoint.ConcurrentTwoWatchpointsOneBreakpoint.test
Name: TestConcurrentTwoWatchpointsOneDelayBreakpoint
Failed: 1 test(s), Passed: 0 test(s), Total: 1 test(s)
  • Failed: TestConcurrentTwoWatchpointsOneDelayBreakpoint.ConcurrentTwoWatchpointsOneDelayBreakpoint.test
Name: TestConcurrentTwoWatchpointsOneSignal
Failed: 1 test(s), Passed: 0 test(s), Total: 1 test(s)
  • Failed: TestConcurrentTwoWatchpointsOneSignal.ConcurrentTwoWatchpointsOneSignal.test
Name: TestConcurrentWatchBreak
Failed: 1 test(s), Passed: 0 test(s), Total: 1 test(s)
  • Failed: TestConcurrentWatchBreak.ConcurrentWatchBreak.test
Name: TestConcurrentWatchBreakDelay
Failed: 1 test(s), Passed: 0 test(s), Total: 1 test(s)
  • Failed: TestConcurrentWatchBreakDelay.ConcurrentWatchBreakDelay.test
Name: TestConcurrentWatchpointDelayWatchpointOneBreakpoint
Failed: 1 test(s), Passed: 0 test(s), Total: 1 test(s)
  • Failed: TestConcurrentWatchpointDelayWatchpointOneBreakpoint.ConcurrentWatchpointDelayWatchpointOneBreakpoint.test
Name: TestConcurrentWatchpointWithDelayWatchpointThreads
Failed: 1 test(s), Passed: 0 test(s), Total: 1 test(s)
  • Failed: TestConcurrentWatchpointWithDelayWatchpointThreads.ConcurrentWatchpointWithDelayWatchpointThreads.test
Name: TestConditionalBreak
Failed: 0 test(s), Passed: 6 test(s), Total: 6 test(s)
Name: TestConsecutiveBreakpoints
Failed: 0 test(s), Passed: 3 test(s), Total: 3 test(s)
Name: TestConstVariables
Failed: 0 test(s), Passed: 3 test(s), Total: 3 test(s)
Name: TestConvenienceVariables
Failed: 0 test(s), Passed: 3 test(s), Total: 3 test(s)
Name: TestCppChainedCalls
Failed: 0 test(s), Passed: 3 test(s), Total: 3 test(s)
Name: TestCppGlobalOperators
Failed: 0 test(s), Passed: 6 test(s), Total: 6 test(s)
Name: TestCppIncompleteTypes
Failed: 0 test(s), Passed: 6 test(s), Total: 6 test(s)
Name: TestCppNsImport
Failed: 0 test(s), Passed: 3 test(s), Total: 3 test(s)
Name: TestCppScope
Failed: 0 test(s), Passed: 6 test(s), Total: 6 test(s)
Name: TestCppValueCast
Failed: 0 test(s), Passed: 6 test(s), Total: 6 test(s)
Name: TestCrashDuringStep
Failed: 0 test(s), Passed: 3 test(s), Total: 3 test(s)
Name: TestCreateAfterAttach
Failed: 0 test(s), Passed: 6 test(s), Total: 6 test(s)
Name: TestCreateDuringInstructionStep
Failed: 0 test(s), Passed: 3 test(s), Total: 3 test(s)
Name: TestCreateDuringStep
Failed: 0 test(s), Passed: 9 test(s), Total: 9 test(s)
Name: TestCxxWCharT
Failed: 0 test(s), Passed: 3 test(s), Total: 3 test(s)
Name: TestDarwinLogBasic
Failed: 0 test(s), Passed: 0 test(s), Total: 1 test(s)
Name: TestDarwinLogFilterMatchActivity
Failed: 0 test(s), Passed: 0 test(s), Total: 4 test(s)
Name: TestDarwinLogFilterMatchActivityChain
Failed: 0 test(s), Passed: 0 test(s), Total: 4 test(s)
Name: TestDarwinLogFilterMatchCategory
Failed: 0 test(s), Passed: 0 test(s), Total: 4 test(s)
Name: TestDarwinLogFilterMatchMessage
Failed: 0 test(s), Passed: 0 test(s), Total: 4 test(s)
Name: TestDarwinLogFilterMatchSubsystem
Failed: 0 test(s), Passed: 0 test(s), Total: 4 test(s)
Name: TestDarwinLogFilterRegexActivity
Failed: 0 test(s), Passed: 0 test(s), Total: 5 test(s)
Name: TestDarwinLogFilterRegexActivityChain
Failed: 0 test(s), Passed: 0 test(s), Total: 5 test(s)
Name: TestDarwinLogFilterRegexCategory
Failed: 0 test(s), Passed: 0 test(s), Total: 5 test(s)
Name: TestDarwinLogFilterRegexMessage
Failed: 0 test(s), Passed: 0 test(s), Total: 5 test(s)
Name: TestDarwinLogFilterRegexSubsystem
Failed: 0 test(s), Passed: 0 test(s), Total: 6 test(s)
Name: TestDarwinLogMessageFormat
Failed: 0 test(s), Passed: 0 test(s), Total: 6 test(s)
Name: TestDarwinLogSourceDebug
Failed: 0 test(s), Passed: 0 test(s), Total: 2 test(s)
Name: TestDarwinLogSourceInfo
Failed: 0 test(s), Passed: 0 test(s), Total: 2 test(s)
Name: TestDataFormatterAdv
Failed: 0 test(s), Passed: 3 test(s), Total: 3 test(s)
Name: TestDataFormatterCategories
Failed: 0 test(s), Passed: 3 test(s), Total: 3 test(s)
Name: TestDataFormatterCpp
Failed: 0 test(s), Passed: 3 test(s), Total: 3 test(s)
Name: TestDataFormatterDisabling
Failed: 0 test(s), Passed: 3 test(s), Total: 3 test(s)
Name: TestDataFormatterEnumFormat
Failed: 0 test(s), Passed: 3 test(s), Total: 3 test(s)
Name: TestDataFormatterGlobals
Failed: 0 test(s), Passed: 3 test(s), Total: 3 test(s)
Name: TestDataFormatterHexCaps
Failed: 0 test(s), Passed: 3 test(s), Total: 3 test(s)
Name: TestDataFormatterLanguageCategoryUpdates
Failed: 0 test(s), Passed: 3 test(s), Total: 3 test(s)
Name: TestDataFormatterLibccIterator
Failed: 0 test(s), Passed: 0 test(s), Total: 3 test(s)
Name: TestDataFormatterLibccMap
Failed: 0 test(s), Passed: 0 test(s), Total: 3 test(s)
Name: TestDataFormatterLibccMultiMap
Failed: 0 test(s), Passed: 0 test(s), Total: 3 test(s)
Name: TestDataFormatterLibcxxList
Failed: 0 test(s), Passed: 0 test(s), Total: 3 test(s)
Name: TestDataFormatterLibcxxListLoop
Failed: 0 test(s), Passed: 0 test(s), Total: 3 test(s)
Name: TestDataFormatterLibcxxMultiSet
Failed: 0 test(s), Passed: 0 test(s), Total: 3 test(s)
Name: TestDataFormatterLibcxxSet
Failed: 0 test(s), Passed: 3 test(s), Total: 3 test(s)
Name: TestDataFormatterLibcxxString
Failed: 0 test(s), Passed: 0 test(s), Total: 3 test(s)
Name: TestDataFormatterLibcxxVBool
Failed: 0 test(s), Passed: 3 test(s), Total: 3 test(s)
Name: TestDataFormatterLibcxxVector
Failed: 0 test(s), Passed: 0 test(s), Total: 3 test(s)
Name: TestDataFormatterNamedSummaries
Failed: 0 test(s), Passed: 3 test(s), Total: 3 test(s)
Name: TestDataFormatterPythonSynth
Failed: 0 test(s), Passed: 6 test(s), Total: 6 test(s)
Name: TestDataFormatterRefPtrRecursion
Failed: 0 test(s), Passed: 3 test(s), Total: 3 test(s)
Name: TestDataFormatterScript
Failed: 0 test(s), Passed: 3 test(s), Total: 3 test(s)
Name: TestDataFormatterSkipSummary
Failed: 0 test(s), Passed: 3 test(s), Total: 3 test(s)
Name: TestDataFormatterSmartArray
Failed: 0 test(s), Passed: 3 test(s), Total: 3 test(s)
Name: TestDataFormatterStdIterator
Failed: 0 test(s), Passed: 3 test(s), Total: 3 test(s)
Name: TestDataFormatterStdList
Failed: 0 test(s), Passed: 3 test(s), Total: 3 test(s)
Name: TestDataFormatterStdMap
Failed: 0 test(s), Passed: 3 test(s), Total: 3 test(s)
Name: TestDataFormatterStdSmartPtr
Failed: 0 test(s), Passed: 3 test(s), Total: 3 test(s)
Name: TestDataFormatterStdString
Failed: 0 test(s), Passed: 3 test(s), Total: 3 test(s)
Name: TestDataFormatterStdTuple
Failed: 0 test(s), Passed: 3 test(s), Total: 3 test(s)
Name: TestDataFormatterStdUniquePtr
Failed: 0 test(s), Passed: 3 test(s), Total: 3 test(s)
Name: TestDataFormatterStdVBool
Failed: 0 test(s), Passed: 3 test(s), Total: 3 test(s)
Name: TestDataFormatterStdVector
Failed: 0 test(s), Passed: 3 test(s), Total: 3 test(s)
Name: TestDataFormatterSynth
Failed: 0 test(s), Passed: 3 test(s), Total: 3 test(s)
Name: TestDataFormatterSynthType
Failed: 0 test(s), Passed: 3 test(s), Total: 3 test(s)
Name: TestDataFormatterSynthVal
Failed: 0 test(s), Passed: 3 test(s), Total: 3 test(s)
Name: TestDataFormatterUnordered
Failed: 0 test(s), Passed: 0 test(s), Total: 3 test(s)
Name: TestDataFormatterVarScriptFormatting
Failed: 0 test(s), Passed: 3 test(s), Total: 3 test(s)
Name: TestDeadStrip
Failed: 0 test(s), Passed: 3 test(s), Total: 3 test(s)
Name: TestDebugBreak
Failed: 0 test(s), Passed: 1 test(s), Total: 1 test(s)
Name: TestDebuggerAPI
Failed: 0 test(s), Passed: 4 test(s), Total: 4 test(s)
Name: TestDefaultCacheLineSize
Failed: 0 test(s), Passed: 0 test(s), Total: 3 test(s)
Name: TestDefaultConstructorForAPIObjects
Failed: 0 test(s), Passed: 35 test(s), Total: 35 test(s)
Name: TestDefiningOverloadedFunctions
Failed: 0 test(s), Passed: 3 test(s), Total: 3 test(s)
Name: TestDiamond
Failed: 0 test(s), Passed: 3 test(s), Total: 3 test(s)
Name: TestDisasmAPI
Failed: 0 test(s), Passed: 3 test(s), Total: 3 test(s)
Name: TestDisassembleBreakpoint
Failed: 0 test(s), Passed: 3 test(s), Total: 3 test(s)
Name: TestDisassembleRawData
Failed: 0 test(s), Passed: 1 test(s), Total: 1 test(s)
Name: TestDisassemble_VST1_64
Failed: 0 test(s), Passed: 0 test(s), Total: 1 test(s)
Name: TestDynamicValue
Failed: 0 test(s), Passed: 3 test(s), Total: 3 test(s)
Name: TestDynamicValueChildCount
Failed: 0 test(s), Passed: 3 test(s), Total: 3 test(s)
Name: TestEhFrameUnwind
Failed: 0 test(s), Passed: 3 test(s), Total: 3 test(s)
Name: TestEmulations
Failed: 0 test(s), Passed: 2 test(s), Total: 2 test(s)
Name: TestEnumTypes
Failed: 0 test(s), Passed: 3 test(s), Total: 3 test(s)
Name: TestEnumVariables
Failed: 0 test(s), Passed: 3 test(s), Total: 3 test(s)
Name: TestEqualityOperators
Failed: 0 test(s), Passed: 9 test(s), Total: 9 test(s)
Name: TestEvents
Failed: 0 test(s), Passed: 0 test(s), Total: 9 test(s)
Name: TestExitDuringBreak
Failed: 0 test(s), Passed: 3 test(s), Total: 3 test(s)
Name: TestExitDuringStep
Failed: 0 test(s), Passed: 9 test(s), Total: 9 test(s)
Name: TestExprDoesntBlock
Failed: 0 test(s), Passed: 3 test(s), Total: 3 test(s)
Name: TestExprHelpExamples
Failed: 0 test(s), Passed: 3 test(s), Total: 3 test(s)
Name: TestExprInProtocolExtension
Failed: 3 test(s), Passed: 0 test(s), Total: 3 test(s)
  • Failed: TestExprInProtocolExtension.TestSwiftExprInProtocolExtension.test_protocol_extension_dwarf
  • Failed: TestExprInProtocolExtension.TestSwiftExprInProtocolExtension.test_protocol_extension_dwo
  • Failed: TestExprInProtocolExtension.TestSwiftExprInProtocolExtension.test_protocol_extension_gmodules
Name: TestExprOptions
Failed: 0 test(s), Passed: 3 test(s), Total: 3 test(s)
Name: TestExpressionAccessControl
Failed: 0 test(s), Passed: 3 test(s), Total: 3 test(s)
Name: TestExpressionErrorBreakpoint
Failed: 0 test(s), Passed: 9 test(s), Total: 12 test(s)
Name: TestExpressionErrors
Failed: 0 test(s), Passed: 3 test(s), Total: 3 test(s)
Name: TestExpressionInSyscall
Failed: 0 test(s), Passed: 3 test(s), Total: 3 test(s)
Name: TestExpressionScopes
Failed: 3 test(s), Passed: 0 test(s), Total: 3 test(s)
  • Failed: TestExpressionScopes.TestSwiftExpressionScopes.test_expression_scopes_dwarf
  • Failed: TestExpressionScopes.TestSwiftExpressionScopes.test_expression_scopes_dwo
  • Failed: TestExpressionScopes.TestSwiftExpressionScopes.test_expression_scopes_gmodules
Name: TestExprs
Failed: 0 test(s), Passed: 12 test(s), Total: 12 test(s)
Name: TestExprs2
Failed: 0 test(s), Passed: 3 test(s), Total: 3 test(s)
Name: TestExprsChar
Failed: 0 test(s), Passed: 9 test(s), Total: 9 test(s)
Name: TestFdLeak
Failed: 0 test(s), Passed: 3 test(s), Total: 3 test(s)
Name: TestFilePrivate
Failed: 0 test(s), Passed: 3 test(s), Total: 3 test(s)
Name: TestFindStructTypes
Failed: 0 test(s), Passed: 1 test(s), Total: 1 test(s)
Name: TestFixIts
Failed: 0 test(s), Passed: 3 test(s), Total: 3 test(s)
Name: TestFloatTypes
Failed: 0 test(s), Passed: 6 test(s), Total: 6 test(s)
Name: TestFloatTypesExpr
Failed: 0 test(s), Passed: 6 test(s), Total: 6 test(s)
Name: TestFormatPropagation
Failed: 0 test(s), Passed: 3 test(s), Total: 3 test(s)
Name: TestFormats
Failed: 0 test(s), Passed: 3 test(s), Total: 3 test(s)
Name: TestFormatters
Failed: 0 test(s), Passed: 3 test(s), Total: 3 test(s)
Name: TestFormattersSBAPI
Failed: 0 test(s), Passed: 6 test(s), Total: 6 test(s)
Name: TestForwardDeclaration
Failed: 0 test(s), Passed: 3 test(s), Total: 3 test(s)
Name: TestFrameDisassemble
Failed: 0 test(s), Passed: 1 test(s), Total: 1 test(s)
Name: TestFrameFormatSmallStruct
Failed: 0 test(s), Passed: 3 test(s), Total: 3 test(s)
Name: TestFrameUtils
Failed: 0 test(s), Passed: 3 test(s), Total: 3 test(s)
Name: TestFrameVariableAnonymousUnions
Failed: 0 test(s), Passed: 3 test(s), Total: 3 test(s)
Name: TestFrames
Failed: 0 test(s), Passed: 9 test(s), Total: 9 test(s)
Name: TestFunctionTypes
Failed: 0 test(s), Passed: 6 test(s), Total: 6 test(s)
Name: TestFunctionVariables
Failed: 0 test(s), Passed: 3 test(s), Total: 3 test(s)
Name: TestGCore
Failed: 0 test(s), Passed: 2 test(s), Total: 2 test(s)
Name: TestGdbRemoteAbort
Failed: 0 test(s), Passed: 1 test(s), Total: 1 test(s)
Name: TestGdbRemoteAttach
Failed: 0 test(s), Passed: 1 test(s), Total: 1 test(s)
Name: TestGdbRemoteAuxvSupport
Failed: 0 test(s), Passed: 4 test(s), Total: 4 test(s)
Name: TestGdbRemoteExitCode
Failed: 0 test(s), Passed: 3 test(s), Total: 3 test(s)
Name: TestGdbRemoteExpeditedRegisters
Failed: 0 test(s), Passed: 5 test(s), Total: 5 test(s)
Name: TestGdbRemoteHostInfo
Failed: 0 test(s), Passed: 1 test(s), Total: 1 test(s)
Name: TestGdbRemoteKill
Failed: 0 test(s), Passed: 1 test(s), Total: 1 test(s)
Name: TestGdbRemoteModuleInfo
Failed: 0 test(s), Passed: 1 test(s), Total: 1 test(s)
Name: TestGdbRemoteProcessInfo
Failed: 0 test(s), Passed: 5 test(s), Total: 5 test(s)
Name: TestGdbRemoteRegisterState
Failed: 0 test(s), Passed: 2 test(s), Total: 2 test(s)
Name: TestGdbRemoteSegFault
Failed: 0 test(s), Passed: 1 test(s), Total: 1 test(s)
Name: TestGdbRemoteSingleStep
Failed: 0 test(s), Passed: 1 test(s), Total: 1 test(s)
Name: TestGdbRemoteThreadsInStopReply
Failed: 0 test(s), Passed: 4 test(s), Total: 4 test(s)
Name: TestGdbRemote_qThreadStopInfo
Failed: 0 test(s), Passed: 3 test(s), Total: 4 test(s)
Name: TestGdbRemote_vCont
Failed: 0 test(s), Passed: 6 test(s), Total: 6 test(s)
Name: TestGlobalVariables
Failed: 0 test(s), Passed: 3 test(s), Total: 3 test(s)
Name: TestGoFormatters
Failed: 0 test(s), Passed: 0 test(s), Total: 1 test(s)
Name: TestGoroutines
Failed: 0 test(s), Passed: 0 test(s), Total: 1 test(s)
Name: TestGuessLanguage
Failed: 0 test(s), Passed: 1 test(s), Total: 1 test(s)
Name: TestHandleSegv
Failed: 0 test(s), Passed: 3 test(s), Total: 3 test(s)
Name: TestHelloWorld
Failed: 0 test(s), Passed: 9 test(s), Total: 9 test(s)
Name: TestHelp
Failed: 0 test(s), Passed: 18 test(s), Total: 18 test(s)
Name: TestIRInterpreter
Failed: 0 test(s), Passed: 3 test(s), Total: 3 test(s)
Name: TestIRInterpreterPHINodes
Failed: 0 test(s), Passed: 3 test(s), Total: 3 test(s)
Name: TestImageListMultiArchitecture
Failed: 0 test(s), Passed: 1 test(s), Total: 1 test(s)
Name: TestImport
Failed: 0 test(s), Passed: 1 test(s), Total: 1 test(s)
Name: TestInOutVariables
Failed: 3 test(s), Passed: 0 test(s), Total: 3 test(s)
  • Failed: TestInOutVariables.TestInOutVariables.test_in_out_variables_dwarf
  • Failed: TestInOutVariables.TestInOutVariables.test_in_out_variables_dwo
  • Failed: TestInOutVariables.TestInOutVariables.test_in_out_variables_gmodules
Name: TestIndexVariable
Failed: 0 test(s), Passed: 3 test(s), Total: 3 test(s)
Name: TestIndirectEnumVariables
Failed: 0 test(s), Passed: 0 test(s), Total: 6 test(s)
Name: TestInferiorAssert
Failed: 0 test(s), Passed: 18 test(s), Total: 18 test(s)
Name: TestInferiorChanged
Failed: 0 test(s), Passed: 1 test(s), Total: 1 test(s)
Name: TestInferiorCrashing
Failed: 0 test(s), Passed: 18 test(s), Total: 21 test(s)
Name: TestInitializerList
Failed: 0 test(s), Passed: 3 test(s), Total: 3 test(s)
Name: TestInlineStepping
Failed: 0 test(s), Passed: 9 test(s), Total: 9 test(s)
Name: TestInlinedBreakpoints
Failed: 0 test(s), Passed: 3 test(s), Total: 3 test(s)
Name: TestInlinedFrame
Failed: 0 test(s), Passed: 3 test(s), Total: 3 test(s)
Name: TestInlines
Failed: 0 test(s), Passed: 3 test(s), Total: 3 test(s)
Name: TestIntegerTypes
Failed: 0 test(s), Passed: 30 test(s), Total: 30 test(s)
Name: TestIntegerTypesExpr
Failed: 0 test(s), Passed: 30 test(s), Total: 30 test(s)
Name: TestJITLoaderGDB
Failed: 0 test(s), Passed: 0 test(s), Total: 3 test(s)
Name: TestLLDBIterator
Failed: 0 test(s), Passed: 9 test(s), Total: 9 test(s)
Name: TestLLVM
Failed: 0 test(s), Passed: 1 test(s), Total: 1 test(s)
Name: TestLaunchWithShellExpand
Failed: 0 test(s), Passed: 3 test(s), Total: 3 test(s)
Name: TestLazyReverse
Failed: 0 test(s), Passed: 1 test(s), Total: 1 test(s)
Name: TestLibCxxAtomic
Failed: 0 test(s), Passed: 0 test(s), Total: 3 test(s)
Name: TestLibCxxFunction
Failed: 0 test(s), Passed: 0 test(s), Total: 3 test(s)
Name: TestLinuxCore
Failed: 0 test(s), Passed: 6 test(s), Total: 6 test(s)
Name: TestLinuxCoreThreads
Failed: 0 test(s), Passed: 2 test(s), Total: 2 test(s)
Name: TestListener
Failed: 0 test(s), Passed: 3 test(s), Total: 3 test(s)
Name: TestLldbGdbServer
Failed: 0 test(s), Passed: 33 test(s), Total: 33 test(s)
Name: TestLoadUnload
Failed: 0 test(s), Passed: 18 test(s), Total: 18 test(s)
Name: TestLogging
Failed: 0 test(s), Passed: 5 test(s), Total: 5 test(s)
Name: TestLongjmp
Failed: 0 test(s), Passed: 9 test(s), Total: 9 test(s)
Name: TestMPXRegisters
Failed: 0 test(s), Passed: 0 test(s), Total: 3 test(s)
Name: TestMacros
Failed: 0 test(s), Passed: 3 test(s), Total: 3 test(s)
Name: TestMembersAndLocalsWithSameName
Failed: 0 test(s), Passed: 6 test(s), Total: 6 test(s)
Name: TestMemoryCache
Failed: 0 test(s), Passed: 3 test(s), Total: 3 test(s)
Name: TestMemoryFind
Failed: 0 test(s), Passed: 3 test(s), Total: 3 test(s)
Name: TestMemoryHistory
Failed: 0 test(s), Passed: 3 test(s), Total: 3 test(s)
Name: TestMemoryRead
Failed: 0 test(s), Passed: 3 test(s), Total: 3 test(s)
Name: TestMiBreak
Failed: 0 test(s), Passed: 7 test(s), Total: 7 test(s)
Name: TestMiCliSupport
Failed: 0 test(s), Passed: 1 test(s), Total: 8 test(s)
Name: TestMiData
Failed: 0 test(s), Passed: 6 test(s), Total: 7 test(s)
Name: TestMiEnvironmentCd
Failed: 0 test(s), Passed: 1 test(s), Total: 1 test(s)
Name: TestMiExec
Failed: 0 test(s), Passed: 9 test(s), Total: 9 test(s)
Name: TestMiExit
Failed: 0 test(s), Passed: 3 test(s), Total: 3 test(s)
Name: TestMiFile
Failed: 0 test(s), Passed: 4 test(s), Total: 4 test(s)
Name: TestMiGdbSetShow
Failed: 0 test(s), Passed: 8 test(s), Total: 9 test(s)
Name: TestMiGdbSetShowPrint
Failed: 0 test(s), Passed: 2 test(s), Total: 3 test(s)
Name: TestMiInterpreterExec
Failed: 0 test(s), Passed: 8 test(s), Total: 8 test(s)
Name: TestMiLibraryLoaded
Failed: 0 test(s), Passed: 1 test(s), Total: 1 test(s)
Name: TestMiPrompt
Failed: 0 test(s), Passed: 1 test(s), Total: 1 test(s)
Name: TestMiSignal
Failed: 0 test(s), Passed: 1 test(s), Total: 3 test(s)
Name: TestMiStack
Failed: 0 test(s), Passed: 6 test(s), Total: 6 test(s)
Name: TestMiStartupOptions
Failed: 0 test(s), Passed: 8 test(s), Total: 10 test(s)
Name: TestMiSymbol
Failed: 0 test(s), Passed: 1 test(s), Total: 1 test(s)
Name: TestMiSyntax
Failed: 0 test(s), Passed: 4 test(s), Total: 4 test(s)
Name: TestMiTarget
Failed: 0 test(s), Passed: 0 test(s), Total: 3 test(s)
Name: TestMiThreadInfo
Failed: 0 test(s), Passed: 1 test(s), Total: 1 test(s)
Name: TestMiVar
Failed: 0 test(s), Passed: 2 test(s), Total: 6 test(s)
Name: TestMiniDump
Failed: 0 test(s), Passed: 3 test(s), Total: 5 test(s)
Name: TestMiniDumpNew
Failed: 0 test(s), Passed: 8 test(s), Total: 8 test(s)
Name: TestMixedLanguages
Failed: 0 test(s), Passed: 3 test(s), Total: 3 test(s)
Name: TestModuleAndSection
Failed: 0 test(s), Passed: 9 test(s), Total: 9 test(s)
Name: TestMultilineExpressions
Failed: 0 test(s), Passed: 3 test(s), Total: 3 test(s)
Name: TestMultipleBreakpoints
Failed: 0 test(s), Passed: 3 test(s), Total: 3 test(s)
Name: TestMultipleDebuggers
Failed: 0 test(s), Passed: 3 test(s), Total: 3 test(s)
Name: TestMultipleDebuggersCommands
Failed: 0 test(s), Passed: 1 test(s), Total: 1 test(s)
Name: TestMultipleHits
Failed: 0 test(s), Passed: 1 test(s), Total: 1 test(s)
Name: TestMultipleTargets
Failed: 0 test(s), Passed: 1 test(s), Total: 1 test(s)
Name: TestMultithreaded
Failed: 0 test(s), Passed: 0 test(s), Total: 12 test(s)
Name: TestMyFirstWatchpoint
Failed: 3 test(s), Passed: 0 test(s), Total: 3 test(s)
  • Failed: TestMyFirstWatchpoint.HelloWatchpointTestCase.test_hello_watchpoint_using_watchpoint_set_dwarf
  • Failed: TestMyFirstWatchpoint.HelloWatchpointTestCase.test_hello_watchpoint_using_watchpoint_set_dwo
  • Failed: TestMyFirstWatchpoint.HelloWatchpointTestCase.test_hello_watchpoint_using_watchpoint_set_gmodules
Name: TestNameLookup
Failed: 0 test(s), Passed: 3 test(s), Total: 3 test(s)
Name: TestNamespace
Failed: 0 test(s), Passed: 12 test(s), Total: 12 test(s)
Name: TestNamespaceDefinitions
Failed: 0 test(s), Passed: 3 test(s), Total: 3 test(s)
Name: TestNamespaceLookup
Failed: 0 test(s), Passed: 24 test(s), Total: 24 test(s)
Name: TestNestedAlias
Failed: 0 test(s), Passed: 3 test(s), Total: 3 test(s)
Name: TestNestedPersistentTypes
Failed: 0 test(s), Passed: 3 test(s), Total: 3 test(s)
Name: TestNoSuchArch
Failed: 0 test(s), Passed: 3 test(s), Total: 3 test(s)
Name: TestNoreturnUnwind
Failed: 0 test(s), Passed: 3 test(s), Total: 3 test(s)
Name: TestNumThreads
Failed: 0 test(s), Passed: 3 test(s), Total: 3 test(s)
Name: TestOverloadedFunctions
Failed: 0 test(s), Passed: 3 test(s), Total: 3 test(s)
Name: TestPOUnwrapping
Failed: 0 test(s), Passed: 1 test(s), Total: 1 test(s)
Name: TestPaths
Failed: 0 test(s), Passed: 2 test(s), Total: 3 test(s)
Name: TestPersistentPtrUpdate
Failed: 0 test(s), Passed: 3 test(s), Total: 3 test(s)
Name: TestPersistentTypes
Failed: 0 test(s), Passed: 3 test(s), Total: 3 test(s)
Name: TestPersistentVariables
Failed: 0 test(s), Passed: 3 test(s), Total: 3 test(s)
Name: TestPlatformCommand
Failed: 0 test(s), Passed: 7 test(s), Total: 8 test(s)
Name: TestPlatformProcessConnect
Failed: 0 test(s), Passed: 0 test(s), Total: 1 test(s)
Name: TestPluginCommands
Failed: 0 test(s), Passed: 1 test(s), Total: 1 test(s)
Name: TestPrintArray
Failed: 0 test(s), Passed: 3 test(s), Total: 3 test(s)
Name: TestPrintStackTraces
Failed: 0 test(s), Passed: 3 test(s), Total: 3 test(s)
Name: TestPrintfAfterUp
Failed: 0 test(s), Passed: 3 test(s), Total: 3 test(s)
Name: TestProcessAPI
Failed: 0 test(s), Passed: 15 test(s), Total: 15 test(s)
Name: TestProcessAttach
Failed: 0 test(s), Passed: 2 test(s), Total: 2 test(s)
Name: TestProcessIO
Failed: 0 test(s), Passed: 15 test(s), Total: 15 test(s)
Name: TestProcessLaunch
Failed: 0 test(s), Passed: 9 test(s), Total: 9 test(s)
Name: TestProcessSaveCore
Failed: 0 test(s), Passed: 0 test(s), Total: 6 test(s)
Name: TestPtrRef2Typedef
Failed: 0 test(s), Passed: 3 test(s), Total: 3 test(s)
Name: TestPtrToArrayFormatting
Failed: 0 test(s), Passed: 3 test(s), Total: 3 test(s)
Name: TestPublicAPIHeaders
Failed: 0 test(s), Passed: 0 test(s), Total: 3 test(s)
Name: TestPyObjSynthProvider
Failed: 0 test(s), Passed: 1 test(s), Total: 1 test(s)
Name: TestPythonOSPlugin
Failed: 0 test(s), Passed: 3 test(s), Total: 3 test(s)
Name: TestQuoting
Failed: 0 test(s), Passed: 11 test(s), Total: 11 test(s)
Name: TestREPLClasses
Failed: 0 test(s), Passed: 1 test(s), Total: 1 test(s)
Name: TestREPLRecursiveClass
Failed: 0 test(s), Passed: 1 test(s), Total: 1 test(s)
Name: TestREPLStructs
Failed: 0 test(s), Passed: 1 test(s), Total: 1 test(s)
Name: TestRaise
Failed: 0 test(s), Passed: 9 test(s), Total: 9 test(s)
Name: TestRdar12586188
Failed: 0 test(s), Passed: 1 test(s), Total: 1 test(s)
Name: TestRecursiveInferior
Failed: 0 test(s), Passed: 18 test(s), Total: 21 test(s)
Name: TestRecursiveTypes
Failed: 0 test(s), Passed: 6 test(s), Total: 6 test(s)
Name: TestRegexpBreakCommand
Failed: 0 test(s), Passed: 3 test(s), Total: 3 test(s)
Name: TestRegisterVariables
Failed: 0 test(s), Passed: 3 test(s), Total: 3 test(s)
Name: TestRegisters
Failed: 0 test(s), Passed: 21 test(s), Total: 21 test(s)
Name: TestRegistersIterator
Failed: 0 test(s), Passed: 3 test(s), Total: 3 test(s)
Name: TestReportData
Failed: 0 test(s), Passed: 3 test(s), Total: 3 test(s)
Name: TestRerun
Failed: 0 test(s), Passed: 3 test(s), Total: 3 test(s)
Name: TestReturnValue
Failed: 0 test(s), Passed: 3 test(s), Total: 3 test(s)
Name: TestRvalueReferences
Failed: 0 test(s), Passed: 3 test(s), Total: 3 test(s)
Name: TestSBData
Failed: 0 test(s), Passed: 3 test(s), Total: 3 test(s)
Name: TestSBFrameFindValue
Failed: 0 test(s), Passed: 3 test(s), Total: 3 test(s)
Name: TestSBValuePersist
Failed: 0 test(s), Passed: 3 test(s), Total: 3 test(s)
Name: TestSBValueUpdates
Failed: 3 test(s), Passed: 0 test(s), Total: 3 test(s)
  • Failed: TestSBValueUpdates.TestSBValueUpdates.test_update_and_format_with_type_change_dwarf
  • Failed: TestSBValueUpdates.TestSBValueUpdates.test_update_and_format_with_type_change_dwo
  • Failed: TestSBValueUpdates.TestSBValueUpdates.test_update_and_format_with_type_change_gmodules
Name: TestSTL
Failed: 0 test(s), Passed: 6 test(s), Total: 6 test(s)
Name: TestSTTYBeforeAndAfter
Failed: 0 test(s), Passed: 0 test(s), Total: 1 test(s)
Name: TestSaveJITObjects
Failed: 0 test(s), Passed: 3 test(s), Total: 3 test(s)
Name: TestSectionAPI
Failed: 0 test(s), Passed: 3 test(s), Total: 3 test(s)
Name: TestSendSignal
Failed: 0 test(s), Passed: 3 test(s), Total: 3 test(s)
Name: TestSequenceFunctions
Failed: 0 test(s), Passed: 3 test(s), Total: 3 test(s)
Name: TestSetValues
Failed: 0 test(s), Passed: 3 test(s), Total: 3 test(s)
Name: TestSetWatchlocation
Failed: 3 test(s), Passed: 0 test(s), Total: 3 test(s)
  • Failed: TestSetWatchlocation.SetWatchlocationAPITestCase.test_watch_location_dwarf
  • Failed: TestSetWatchlocation.SetWatchlocationAPITestCase.test_watch_location_dwo
  • Failed: TestSetWatchlocation.SetWatchlocationAPITestCase.test_watch_location_gmodules
Name: TestSetWatchpoint
Failed: 3 test(s), Passed: 0 test(s), Total: 3 test(s)
  • Failed: TestSetWatchpoint.SetWatchpointAPITestCase.test_watch_val_dwarf
  • Failed: TestSetWatchpoint.SetWatchpointAPITestCase.test_watch_val_dwo
  • Failed: TestSetWatchpoint.SetWatchpointAPITestCase.test_watch_val_gmodules
Name: TestSettings
Failed: 0 test(s), Passed: 29 test(s), Total: 29 test(s)
Name: TestSharedLib
Failed: 0 test(s), Passed: 6 test(s), Total: 6 test(s)
Name: TestSharedLibStrippedSymbols
Failed: 0 test(s), Passed: 6 test(s), Total: 6 test(s)
Name: TestSignalsAPI
Failed: 0 test(s), Passed: 3 test(s), Total: 3 test(s)
Name: TestSignedTypes
Failed: 0 test(s), Passed: 3 test(s), Total: 3 test(s)
Name: TestSimpleExpressions
Failed: 3 test(s), Passed: 0 test(s), Total: 3 test(s)
  • Failed: TestSimpleExpressions.TestSimpleSwiftExpressions.test_simple_swift_expressions_dwarf
  • Failed: TestSimpleExpressions.TestSimpleSwiftExpressions.test_simple_swift_expressions_dwo
  • Failed: TestSimpleExpressions.TestSimpleSwiftExpressions.test_simple_swift_expressions_gmodules
Name: TestSingleQuoteInFilename
Failed: 0 test(s), Passed: 1 test(s), Total: 1 test(s)
Name: TestSourceManager
Failed: 0 test(s), Passed: 5 test(s), Total: 5 test(s)
Name: TestSourceRegexBreakpoints
Failed: 0 test(s), Passed: 6 test(s), Total: 6 test(s)
Name: TestStaticVariables
Failed: 0 test(s), Passed: 6 test(s), Total: 6 test(s)
Name: TestStepAndBreakpoints
Failed: 0 test(s), Passed: 3 test(s), Total: 3 test(s)
Name: TestStepNoDebug
Failed: 0 test(s), Passed: 9 test(s), Total: 9 test(s)
Name: TestStepOverWatchpoint
Failed: 0 test(s), Passed: 3 test(s), Total: 3 test(s)
Name: TestStepTarget
Failed: 0 test(s), Passed: 15 test(s), Total: 15 test(s)
Name: TestStepUntil
Failed: 0 test(s), Passed: 12 test(s), Total: 12 test(s)
Name: TestStopHookCmd
Failed: 0 test(s), Passed: 4 test(s), Total: 4 test(s)
Name: TestStopHookMechanism
Failed: 0 test(s), Passed: 3 test(s), Total: 3 test(s)
Name: TestStopHookMultipleThreads
Failed: 0 test(s), Passed: 3 test(s), Total: 3 test(s)
Name: TestStubReverseConnect
Failed: 0 test(s), Passed: 1 test(s), Total: 1 test(s)
Name: TestStubSetSID
Failed: 0 test(s), Passed: 3 test(s), Total: 3 test(s)
Name: TestSwiftAnyObjectType
Failed: 0 test(s), Passed: 3 test(s), Total: 3 test(s)
Name: TestSwiftAnyType
Failed: 0 test(s), Passed: 3 test(s), Total: 3 test(s)
Name: TestSwiftArchetypeResolution
Failed: 3 test(s), Passed: 0 test(s), Total: 3 test(s)
  • Failed: TestSwiftArchetypeResolution.TestSwiftArchetypeResolution.test_swift_archetype_resolution_dwarf
  • Failed: TestSwiftArchetypeResolution.TestSwiftArchetypeResolution.test_swift_archetype_resolution_dwo
  • Failed: TestSwiftArchetypeResolution.TestSwiftArchetypeResolution.test_swift_archetype_resolution_gmodules
Name: TestSwiftArrayType
Failed: 0 test(s), Passed: 0 test(s), Total: 3 test(s)
Name: TestSwiftAssociatedTypeResolution
Failed: 0 test(s), Passed: 3 test(s), Total: 3 test(s)
Name: TestSwiftBacktracePrinting
Failed: 0 test(s), Passed: 3 test(s), Total: 3 test(s)
Name: TestSwiftBreakByPartialName
Failed: 0 test(s), Passed: 3 test(s), Total: 3 test(s)
Name: TestSwiftClassTypes
Failed: 0 test(s), Passed: 3 test(s), Total: 3 test(s)
Name: TestSwiftConditionalBreakpoint
Failed: 0 test(s), Passed: 3 test(s), Total: 3 test(s)
Name: TestSwiftDynamicValue
Failed: 3 test(s), Passed: 0 test(s), Total: 3 test(s)
  • Failed: TestSwiftDynamicValue.SwiftDynamicValueTest.test_dynamic_value_dwarf
  • Failed: TestSwiftDynamicValue.SwiftDynamicValueTest.test_dynamic_value_dwo
  • Failed: TestSwiftDynamicValue.SwiftDynamicValueTest.test_dynamic_value_gmodules
Name: TestSwiftExpressionsInClassFunctions
Failed: 3 test(s), Passed: 0 test(s), Total: 3 test(s)
  • Failed: TestSwiftExpressionsInClassFunctions.TestSwiftExpressionsInClassFunctions.test_expressions_in_class_functions_dwarf
  • Failed: TestSwiftExpressionsInClassFunctions.TestSwiftExpressionsInClassFunctions.test_expressions_in_class_functions_dwo
  • Failed: TestSwiftExpressionsInClassFunctions.TestSwiftExpressionsInClassFunctions.test_expressions_in_class_functions_gmodules
Name: TestSwiftExpressionsInMethodsPureSwift
Failed: 0 test(s), Passed: 3 test(s), Total: 3 test(s)
Name: TestSwiftFixIts
Failed: 0 test(s), Passed: 3 test(s), Total: 3 test(s)
Name: TestSwiftGenericEnums
Failed: 0 test(s), Passed: 3 test(s), Total: 3 test(s)
Name: TestSwiftGenericExpressions
Failed: 0 test(s), Passed: 3 test(s), Total: 6 test(s)
Name: TestSwiftGenericTupleLabels
Failed: 3 test(s), Passed: 0 test(s), Total: 3 test(s)
  • Failed: TestSwiftGenericTupleLabels.TestSwiftGenericTupleLabels.test_generic_tuple_labels_dwarf
  • Failed: TestSwiftGenericTupleLabels.TestSwiftGenericTupleLabels.test_generic_tuple_labels_dwo
  • Failed: TestSwiftGenericTupleLabels.TestSwiftGenericTupleLabels.test_generic_tuple_labels_gmodules
Name: TestSwiftGenericTypes
Failed: 3 test(s), Passed: 0 test(s), Total: 3 test(s)
  • Failed: TestSwiftGenericTypes.TestSwiftGenericTypes.test_swift_generic_types_dwarf
  • Failed: TestSwiftGenericTypes.TestSwiftGenericTypes.test_swift_generic_types_dwo
  • Failed: TestSwiftGenericTypes.TestSwiftGenericTypes.test_swift_generic_types_gmodules
Name: TestSwiftGenericsResolution
Failed: 3 test(s), Passed: 0 test(s), Total: 3 test(s)
  • Failed: TestSwiftGenericsResolution.SwiftDynamicTypeGenericsTest.test_genericresolution_commands_dwarf
  • Failed: TestSwiftGenericsResolution.SwiftDynamicTypeGenericsTest.test_genericresolution_commands_dwo
  • Failed: TestSwiftGenericsResolution.SwiftDynamicTypeGenericsTest.test_genericresolution_commands_gmodules
Name: TestSwiftGetValueAsUnsigned
Failed: 0 test(s), Passed: 3 test(s), Total: 3 test(s)
Name: TestSwiftGlobals
Failed: 3 test(s), Passed: 0 test(s), Total: 3 test(s)
  • Failed: TestSwiftGlobals.TestSwiftGlobals.test_swift_globals_dwarf
  • Failed: TestSwiftGlobals.TestSwiftGlobals.test_swift_globals_dwo
  • Failed: TestSwiftGlobals.TestSwiftGlobals.test_swift_globals_gmodules
Name: TestSwiftHideRuntimeSupport
Failed: 3 test(s), Passed: 0 test(s), Total: 3 test(s)
  • Failed: TestSwiftHideRuntimeSupport.TestSwiftHideRuntimeSupport.test_swift_hide_runtime_support_dwarf
  • Failed: TestSwiftHideRuntimeSupport.TestSwiftHideRuntimeSupport.test_swift_hide_runtime_support_dwo
  • Failed: TestSwiftHideRuntimeSupport.TestSwiftHideRuntimeSupport.test_swift_hide_runtime_support_gmodules
Name: TestSwiftInstancePointerSetSP
Failed: 3 test(s), Passed: 0 test(s), Total: 3 test(s)
  • Failed: TestSwiftInstancePointerSetSP.TestSwiftInstancePointerSetSP.test_instancepointerset_sp_dwarf
  • Failed: TestSwiftInstancePointerSetSP.TestSwiftInstancePointerSetSP.test_instancepointerset_sp_dwo
  • Failed: TestSwiftInstancePointerSetSP.TestSwiftInstancePointerSetSP.test_instancepointerset_sp_gmodules
Name: TestSwiftLetInt
Failed: 0 test(s), Passed: 3 test(s), Total: 3 test(s)
Name: TestSwiftMetadataSymbols
Failed: 0 test(s), Passed: 3 test(s), Total: 3 test(s)
Name: TestSwiftMetatype
Failed: 0 test(s), Passed: 3 test(s), Total: 3 test(s)
Name: TestSwiftModuleSearchPaths
Failed: 0 test(s), Passed: 3 test(s), Total: 3 test(s)
Name: TestSwiftMultipayloadEnum
Failed: 0 test(s), Passed: 3 test(s), Total: 3 test(s)
Name: TestSwiftNestedArray
Failed: 0 test(s), Passed: 3 test(s), Total: 3 test(s)
Name: TestSwiftOneCaseEnum
Failed: 3 test(s), Passed: 0 test(s), Total: 3 test(s)
  • Failed: TestSwiftOneCaseEnum.TestSwiftOneCaseEnum.test_swift_one_case_enum_dwarf
  • Failed: TestSwiftOneCaseEnum.TestSwiftOneCaseEnum.test_swift_one_case_enum_dwo
  • Failed: TestSwiftOneCaseEnum.TestSwiftOneCaseEnum.test_swift_one_case_enum_gmodules
Name: TestSwiftOptionals
Failed: 0 test(s), Passed: 3 test(s), Total: 3 test(s)
Name: TestSwiftPrivateDeclName
Failed: 0 test(s), Passed: 3 test(s), Total: 3 test(s)
Name: TestSwiftPrivateTypeAlias
Failed: 0 test(s), Passed: 3 test(s), Total: 3 test(s)
Name: TestSwiftProtocolTypes
Failed: 0 test(s), Passed: 3 test(s), Total: 3 test(s)
Name: TestSwiftRangeTypes
Failed: 0 test(s), Passed: 3 test(s), Total: 3 test(s)
Name: TestSwiftReferenceStorageTypes
Failed: 0 test(s), Passed: 3 test(s), Total: 3 test(s)
Name: TestSwiftReturns
Failed: 0 test(s), Passed: 0 test(s), Total: 3 test(s)
Name: TestSwiftStaticStringVariables
Failed: 0 test(s), Passed: 3 test(s), Total: 3 test(s)
Name: TestSwiftStdlibDictionary
Failed: 0 test(s), Passed: 0 test(s), Total: 3 test(s)
Name: TestSwiftStdlibSet
Failed: 0 test(s), Passed: 3 test(s), Total: 3 test(s)
Name: TestSwiftStepping
Failed: 0 test(s), Passed: 3 test(s), Total: 3 test(s)
Name: TestSwiftStringVariables
Failed: 0 test(s), Passed: 3 test(s), Total: 3 test(s)
Name: TestSwiftStructChangeRerun
Failed: 0 test(s), Passed: 0 test(s), Total: 3 test(s)
Name: TestSwiftStructInit
Failed: 0 test(s), Passed: 3 test(s), Total: 3 test(s)
Name: TestSwiftTupleTypes
Failed: 0 test(s), Passed: 3 test(s), Total: 3 test(s)
Name: TestSwiftTypeAliasFormatters
Failed: 0 test(s), Passed: 3 test(s), Total: 3 test(s)
Name: TestSwiftTypeLookup
Failed: 0 test(s), Passed: 3 test(s), Total: 3 test(s)
Name: TestSwiftTypeMetadata
Failed: 0 test(s), Passed: 0 test(s), Total: 3 test(s)
Name: TestSwiftTypes
Failed: 0 test(s), Passed: 3 test(s), Total: 3 test(s)
Name: TestSwiftValueOfOptionals
Failed: 0 test(s), Passed: 3 test(s), Total: 3 test(s)
Name: TestSymbolAPI
Failed: 0 test(s), Passed: 3 test(s), Total: 3 test(s)
Name: TestSymbolContext
Failed: 0 test(s), Passed: 3 test(s), Total: 3 test(s)
Name: TestSymbolContextTwoFiles
Failed: 0 test(s), Passed: 6 test(s), Total: 6 test(s)
Name: TestSyntheticCapping
Failed: 0 test(s), Passed: 3 test(s), Total: 3 test(s)
Name: TestTargetAPI
Failed: 0 test(s), Passed: 30 test(s), Total: 30 test(s)
Name: TestTargetCommand
Failed: 0 test(s), Passed: 9 test(s), Total: 9 test(s)
Name: TestTargetWatchAddress
Failed: 3 test(s), Passed: 3 test(s), Total: 6 test(s)
  • Failed: TestTargetWatchAddress.TargetWatchAddressAPITestCase.test_watch_address_dwarf
  • Failed: TestTargetWatchAddress.TargetWatchAddressAPITestCase.test_watch_address_dwo
  • Failed: TestTargetWatchAddress.TargetWatchAddressAPITestCase.test_watch_address_gmodules
Name: TestTemplateArgs
Failed: 0 test(s), Passed: 6 test(s), Total: 6 test(s)
Name: TestTestId
Failed: 0 test(s), Passed: 1 test(s), Total: 1 test(s)
Name: TestThreadAPI
Failed: 0 test(s), Passed: 15 test(s), Total: 15 test(s)
Name: TestThreadExit
Failed: 0 test(s), Passed: 3 test(s), Total: 3 test(s)
Name: TestThreadJump
Failed: 0 test(s), Passed: 3 test(s), Total: 3 test(s)
Name: TestThreadSpecificBpPlusCondition
Failed: 0 test(s), Passed: 3 test(s), Total: 3 test(s)
Name: TestThreadSpecificBreakpoint
Failed: 0 test(s), Passed: 3 test(s), Total: 3 test(s)
Name: TestThreadStates
Failed: 0 test(s), Passed: 15 test(s), Total: 15 test(s)
Name: TestThreadStepOut
Failed: 0 test(s), Passed: 0 test(s), Total: 9 test(s)
Name: TestThreadStepping
Failed: 0 test(s), Passed: 3 test(s), Total: 3 test(s)
Name: TestTlsGlobals
Failed: 0 test(s), Passed: 3 test(s), Total: 3 test(s)
Name: TestTopLevelExprs
Failed: 0 test(s), Passed: 2 test(s), Total: 3 test(s)
Name: TestTsanBasic
Failed: 0 test(s), Passed: 3 test(s), Total: 3 test(s)
Name: TestTsanCPPGlobalLocation
Failed: 0 test(s), Passed: 3 test(s), Total: 3 test(s)
Name: TestTsanGlobalLocation
Failed: 0 test(s), Passed: 3 test(s), Total: 3 test(s)
Name: TestTsanMultiple
Failed: 0 test(s), Passed: 3 test(s), Total: 3 test(s)
Name: TestTsanSwift
Failed: 0 test(s), Passed: 0 test(s), Total: 3 test(s)
Name: TestTsanThreadLeak
Failed: 0 test(s), Passed: 3 test(s), Total: 3 test(s)
Name: TestTsanThreadNumbers
Failed: 0 test(s), Passed: 3 test(s), Total: 3 test(s)
Name: TestTypeCompletion
Failed: 0 test(s), Passed: 3 test(s), Total: 3 test(s)
Name: TestTypeList
Failed: 0 test(s), Passed: 3 test(s), Total: 3 test(s)
Name: TestTypeSummaryListArg
Failed: 0 test(s), Passed: 1 test(s), Total: 1 test(s)
Name: TestTypeSummaryListScript
Failed: 0 test(s), Passed: 3 test(s), Total: 3 test(s)
Name: TestUnicodeLiterals
Failed: 0 test(s), Passed: 9 test(s), Total: 9 test(s)
Name: TestUnionMembers
Failed: 0 test(s), Passed: 3 test(s), Total: 3 test(s)
Name: TestUniqueTypes
Failed: 0 test(s), Passed: 3 test(s), Total: 3 test(s)
Name: TestUnsignedTypes
Failed: 0 test(s), Passed: 3 test(s), Total: 3 test(s)
Name: TestUnwindExpression
Failed: 0 test(s), Passed: 3 test(s), Total: 3 test(s)
Name: TestUserFormatVsSummary
Failed: 0 test(s), Passed: 3 test(s), Total: 3 test(s)
Name: TestValueAPI
Failed: 0 test(s), Passed: 3 test(s), Total: 3 test(s)
Name: TestValueAPIEmptyClass
Failed: 0 test(s), Passed: 3 test(s), Total: 3 test(s)
Name: TestValueAPILinkedList
Failed: 0 test(s), Passed: 3 test(s), Total: 3 test(s)
Name: TestValueMD5Crash
Failed: 0 test(s), Passed: 3 test(s), Total: 3 test(s)
Name: TestValueObjectRecursion
Failed: 0 test(s), Passed: 3 test(s), Total: 3 test(s)
Name: TestValueOfVectorVariable
Failed: 0 test(s), Passed: 3 test(s), Total: 3 test(s)
Name: TestValueVarUpdate
Failed: 0 test(s), Passed: 3 test(s), Total: 3 test(s)
Name: TestVarInAggregateMisuse
Failed: 0 test(s), Passed: 3 test(s), Total: 3 test(s)
Name: TestVectorTypesFormatting
Failed: 0 test(s), Passed: 3 test(s), Total: 3 test(s)
Name: TestVirtual
Failed: 0 test(s), Passed: 3 test(s), Total: 3 test(s)
Name: TestWatchLocation
Failed: 0 test(s), Passed: 3 test(s), Total: 3 test(s)
Name: TestWatchLocationWithWatchSet
Failed: 3 test(s), Passed: 0 test(s), Total: 3 test(s)
  • Failed: TestWatchLocationWithWatchSet.WatchLocationUsingWatchpointSetTestCase.test_watchlocation_using_watchpoint_set_dwarf
  • Failed: TestWatchLocationWithWatchSet.WatchLocationUsingWatchpointSetTestCase.test_watchlocation_using_watchpoint_set_dwo
  • Failed: TestWatchLocationWithWatchSet.WatchLocationUsingWatchpointSetTestCase.test_watchlocation_using_watchpoint_set_gmodules
Name: TestWatchedVarHitWhenInScope
Failed: 0 test(s), Passed: 3 test(s), Total: 3 test(s)
Name: TestWatchpointCommandLLDB
Failed: 6 test(s), Passed: 0 test(s), Total: 6 test(s)
  • Failed: TestWatchpointCommandLLDB.WatchpointLLDBCommandTestCase.test_watchpoint_command_can_disable_a_watchpoint_dwarf
  • Failed: TestWatchpointCommandLLDB.WatchpointLLDBCommandTestCase.test_watchpoint_command_can_disable_a_watchpoint_dwo
  • Failed: TestWatchpointCommandLLDB.WatchpointLLDBCommandTestCase.test_watchpoint_command_can_disable_a_watchpoint_gmodules
  • Failed: TestWatchpointCommandLLDB.WatchpointLLDBCommandTestCase.test_watchpoint_command_dwarf
  • Failed: TestWatchpointCommandLLDB.WatchpointLLDBCommandTestCase.test_watchpoint_command_dwo
  • Failed: TestWatchpointCommandLLDB.WatchpointLLDBCommandTestCase.test_watchpoint_command_gmodules
Name: TestWatchpointCommandPython
Failed: 6 test(s), Passed: 0 test(s), Total: 6 test(s)
  • Failed: TestWatchpointCommandPython.WatchpointPythonCommandTestCase.test_continue_in_watchpoint_command_dwarf
  • Failed: TestWatchpointCommandPython.WatchpointPythonCommandTestCase.test_continue_in_watchpoint_command_dwo
  • Failed: TestWatchpointCommandPython.WatchpointPythonCommandTestCase.test_continue_in_watchpoint_command_gmodules
  • Failed: TestWatchpointCommandPython.WatchpointPythonCommandTestCase.test_watchpoint_command_dwarf
  • Failed: TestWatchpointCommandPython.WatchpointPythonCommandTestCase.test_watchpoint_command_dwo
  • Failed: TestWatchpointCommandPython.WatchpointPythonCommandTestCase.test_watchpoint_command_gmodules
Name: TestWatchpointCommands
Failed: 12 test(s), Passed: 3 test(s), Total: 15 test(s)
  • Failed: TestWatchpointCommands.WatchpointCommandsTestCase.test_rw_disable_after_first_stop_dwarf
  • Failed: TestWatchpointCommands.WatchpointCommandsTestCase.test_rw_disable_after_first_stop_dwo
  • Failed: TestWatchpointCommands.WatchpointCommandsTestCase.test_rw_disable_after_first_stop_gmodules
  • Failed: TestWatchpointCommands.WatchpointCommandsTestCase.test_rw_disable_then_enable_dwarf
  • Failed: TestWatchpointCommands.WatchpointCommandsTestCase.test_rw_disable_then_enable_dwo
  • Failed: TestWatchpointCommands.WatchpointCommandsTestCase.test_rw_disable_then_enable_gmodules
  • Failed: TestWatchpointCommands.WatchpointCommandsTestCase.test_rw_watchpoint_dwarf
  • Failed: TestWatchpointCommands.WatchpointCommandsTestCase.test_rw_watchpoint_dwo
  • Failed: TestWatchpointCommands.WatchpointCommandsTestCase.test_rw_watchpoint_gmodules
  • Failed: TestWatchpointCommands.WatchpointCommandsTestCase.test_rw_watchpoint_set_ignore_count_dwarf
  • Failed: TestWatchpointCommands.WatchpointCommandsTestCase.test_rw_watchpoint_set_ignore_count_dwo
  • Failed: TestWatchpointCommands.WatchpointCommandsTestCase.test_rw_watchpoint_set_ignore_count_gmodules
Name: TestWatchpointConditionAPI
Failed: 3 test(s), Passed: 0 test(s), Total: 3 test(s)
  • Failed: TestWatchpointConditionAPI.WatchpointConditionAPITestCase.test_watchpoint_cond_api_dwarf
  • Failed: TestWatchpointConditionAPI.WatchpointConditionAPITestCase.test_watchpoint_cond_api_dwo
  • Failed: TestWatchpointConditionAPI.WatchpointConditionAPITestCase.test_watchpoint_cond_api_gmodules
Name: TestWatchpointConditionCmd
Failed: 3 test(s), Passed: 0 test(s), Total: 3 test(s)
  • Failed: TestWatchpointConditionCmd.WatchpointConditionCmdTestCase.test_watchpoint_cond_dwarf
  • Failed: TestWatchpointConditionCmd.WatchpointConditionCmdTestCase.test_watchpoint_cond_dwo
  • Failed: TestWatchpointConditionCmd.WatchpointConditionCmdTestCase.test_watchpoint_cond_gmodules
Name: TestWatchpointDisable
Failed: 3 test(s), Passed: 3 test(s), Total: 6 test(s)
  • Failed: TestWatchpointDisable.TestWatchpointSetEnable.test_disable_enable_works_dwarf
  • Failed: TestWatchpointDisable.TestWatchpointSetEnable.test_disable_enable_works_dwo
  • Failed: TestWatchpointDisable.TestWatchpointSetEnable.test_disable_enable_works_gmodules
Name: TestWatchpointEvents
Failed: 0 test(s), Passed: 3 test(s), Total: 3 test(s)
Name: TestWatchpointIgnoreCount
Failed: 3 test(s), Passed: 0 test(s), Total: 3 test(s)
  • Failed: TestWatchpointIgnoreCount.WatchpointIgnoreCountTestCase.test_set_watch_ignore_count_dwarf
  • Failed: TestWatchpointIgnoreCount.WatchpointIgnoreCountTestCase.test_set_watch_ignore_count_dwo
  • Failed: TestWatchpointIgnoreCount.WatchpointIgnoreCountTestCase.test_set_watch_ignore_count_gmodules
Name: TestWatchpointIter
Failed: 3 test(s), Passed: 0 test(s), Total: 3 test(s)
  • Failed: TestWatchpointIter.WatchpointIteratorTestCase.test_watch_iter_dwarf
  • Failed: TestWatchpointIter.WatchpointIteratorTestCase.test_watch_iter_dwo
  • Failed: TestWatchpointIter.WatchpointIteratorTestCase.test_watch_iter_gmodules
Name: TestWatchpointMultipleSlots
Failed: 0 test(s), Passed: 0 test(s), Total: 1 test(s)
Name: TestWatchpointMultipleThreads
Failed: 3 test(s), Passed: 3 test(s), Total: 6 test(s)
  • Failed: TestWatchpointMultipleThreads.WatchpointForMultipleThreadsTestCase.test_watchpoint_multiple_threads_dwarf
  • Failed: TestWatchpointMultipleThreads.WatchpointForMultipleThreadsTestCase.test_watchpoint_multiple_threads_dwo
  • Failed: TestWatchpointMultipleThreads.WatchpointForMultipleThreadsTestCase.test_watchpoint_multiple_threads_gmodules
Name: TestWatchpointSetErrorCases
Failed: 0 test(s), Passed: 3 test(s), Total: 3 test(s)
Name: TestWatchpointSizes
Failed: 3 test(s), Passed: 0 test(s), Total: 3 test(s)
  • Failed: TestWatchpointSizes.WatchpointSizeTestCase.test_byte_size_watchpoints_with_byte_selection
  • Failed: TestWatchpointSizes.WatchpointSizeTestCase.test_four_byte_watchpoints_with_dword_selection
  • Failed: TestWatchpointSizes.WatchpointSizeTestCase.test_two_byte_watchpoints_with_word_selection
Name: TestWithLimitDebugInfo
Failed: 0 test(s), Passed: 1 test(s), Total: 3 test(s)
Name: TestWithModuleDebugging
Failed: 0 test(s), Passed: 1 test(s), Total: 1 test(s)
Name: TestWow64MiniDump
Failed: 0 test(s), Passed: 3 test(s), Total: 3 test(s)
Name: TestYMMRegister
Failed: 0 test(s), Passed: 3 test(s), Total: 3 test(s)
Name: Testtypedef
Failed: 0 test(s), Passed: 3 test(s), Total: 3 test(s)
Name: lldbsuite.test.lldbtest
Failed: 21 test(s), Passed: 108 test(s), Total: 159 test(s)
  • Failed: lldbsuite.test.lldbtest.TestSwiftGenericStructDebugInfoGenericApply.test_with_dwarf
  • Failed: lldbsuite.test.lldbtest.TestSwiftGenericStructDebugInfoGenericApply.test_with_dwo
  • Failed: lldbsuite.test.lldbtest.TestSwiftGenericStructDebugInfoGenericApply.test_with_gmodules
  • Failed: lldbsuite.test.lldbtest.TestSwiftGenericStructDebugInfoGenericArray.test_with_dwarf
  • Failed: lldbsuite.test.lldbtest.TestSwiftGenericStructDebugInfoGenericArray.test_with_dwo
  • Failed: lldbsuite.test.lldbtest.TestSwiftGenericStructDebugInfoGenericArray.test_with_gmodules
  • Failed: lldbsuite.test.lldbtest.TestSwiftGenericStructDebugInfoGenericFlatMap.test_with_dwarf
  • Failed: lldbsuite.test.lldbtest.TestSwiftGenericStructDebugInfoGenericFlatMap.test_with_dwo
  • Failed: lldbsuite.test.lldbtest.TestSwiftGenericStructDebugInfoGenericFlatMap.test_with_gmodules
  • Failed: lldbsuite.test.lldbtest.TestSwiftPOConflictedTypes.test_with_dwarf
  • Failed: lldbsuite.test.lldbtest.TestSwiftPOConflictedTypes.test_with_dwo
  • Failed: lldbsuite.test.lldbtest.TestSwiftPOConflictedTypes.test_with_gmodules
  • Failed: lldbsuite.test.lldbtest.TestSwiftPORecursiveBehavior.test_with_dwarf
  • Failed: lldbsuite.test.lldbtest.TestSwiftPORecursiveBehavior.test_with_dwo
  • Failed: lldbsuite.test.lldbtest.TestSwiftPORecursiveBehavior.test_with_gmodules
  • Failed: lldbsuite.test.lldbtest.TestSwiftPORefTypes.test_with_dwarf
  • Failed: lldbsuite.test.lldbtest.TestSwiftPORefTypes.test_with_dwo
  • Failed: lldbsuite.test.lldbtest.TestSwiftPORefTypes.test_with_gmodules
  • Failed: lldbsuite.test.lldbtest.TestSwiftPOValTypes.test_with_dwarf
  • Failed: lldbsuite.test.lldbtest.TestSwiftPOValTypes.test_with_dwo
  • Failed: lldbsuite.test.lldbtest.TestSwiftPOValTypes.test_with_gmodules

Changes

  • Commit e494e3fbfee10a7e8160dad5fa7b5b9317ad9fc7 by Michael Gottesman:
[lexicon] Define irrefutable and refutable pattern in the Lexicon.

    • edit: docs/Lexicon.rst

  • Commit 915b3198107fb1f0c200e433227dcca7c9943343 by Andrew Trick:
[AccessEnforce] must handle `undef` before diagnostics.

    • edit: lib/SILOptimizer/Mandatory/AccessEnforcementSelection.cpp
    • edit: test/SILOptimizer/access_enforcement_selection.swift

  • Commit 081f2396e513f3d45aab2944019ec316cda32130 by Michael Gottesman:
[silgen] Refactor emitLocalVariableWithCleanup to take an optional

    • edit: lib/SILGen/SILGenConstructor.cpp
    • edit: lib/SILGen/SILGenDecl.cpp
    • edit: lib/SILGen/SILGenFunction.h

  • Commit 6846b89e9099a75eebe7c817d3dc7a21579b7688 by Michael Gottesman:
[silgen] Instead of creating our own mark_uninitialized, use the new

    • edit: lib/SILGen/SILGenConstructor.cpp

  • Commit 63475950e5ce6a54a4e50596820ca8c9a82131a2 by Bruno Cardoso Lopes:
[modules] Delay calling DeclMustBeEmitted until it's safe.

    • edit: lib/Serialization/ASTReader.cpp
    • edit: include/clang/Serialization/ASTReader.h
    • edit: lib/Serialization/ASTReaderDecl.cpp

_______________________________________________
swift-lldb-dev mailing list
swift-lldb-dev@swift.org
https://lists.swift.org/mailman/listinfo/swift-lldb-dev