[Swift CI] Build Still Failing: 0. OSS - LLDB Incremental - Ubuntu 14.04 (master) #4018


(Tony Parker) #1

CMake Error: Target section_magic_begin-linux-x86_64 has dependency information when it shouldn't.
Your cache is probably stale. Please remove the entry
  section_magic_begin-linux-x86_64_LIB_DEPENDS
from the cache.
CMake Error: Target section_magic_end-linux-x86_64 has dependency information when it shouldn't.
Your cache is probably stale. Please remove the entry
  section_magic_end-linux-x86_64_LIB_DEPENDS
from the cache.

Not sure what this means?

- Tony

···

On Jun 22, 2016, at 10:19 AM, no-reply@swift.org wrote:

New issue found!

[FAILURE] oss-lldb-incremental-linux-ubuntu-14_04 [#4018]

Build URL: https://ci.swift.org/job/oss-lldb-incremental-linux-ubuntu-14_04/4018/
Project: oss-lldb-incremental-linux-ubuntu-14_04
Date of build: Wed, 22 Jun 2016 10:19:07 -0700
Build duration: 36 sec
Identified problems:

Compile Error: This build failed because of a compile error. Below is a list of all errors in the build log:
Indication 1 <https://ci.swift.org//job/oss-lldb-incremental-linux-ubuntu-14_04/4018/consoleFull#296541174ee1a197b-acac-4b17-83cf-a53b95139a76>
Changes

Commit 98db2cbca996177747308ef214fc6ed1b3ba6de6 by mgottesman:
[cmake] Do not use LLVM's configure_lit_site_cfg to configure out lit

edit: test/CMakeLists.txt

Commit 7c0910a2ec487ff3ac06da50cfe2f147a95f351d by anthony.parker:
Address review feedback

edit: stdlib/public/SDK/Foundation/Data.swift


(Todd Fiala) #2

Probably needs a clean build. I'll give that a shot in a minute.

···

On Wednesday, June 22, 2016, Tony Parker via swift-lldb-dev < swift-lldb-dev@swift.org> wrote:

CMake Error: Target section_magic_begin-linux-x86_64 has dependency information when it shouldn't.
Your cache is probably stale. Please remove the entry
  section_magic_begin-linux-x86_64_LIB_DEPENDS
from the cache.
CMake Error: Target section_magic_end-linux-x86_64 has dependency information when it shouldn't.
Your cache is probably stale. Please remove the entry
  section_magic_end-linux-x86_64_LIB_DEPENDS
from the cache.

Not sure what this means?

- Tony

On Jun 22, 2016, at 10:19 AM, no-reply@swift.org > <javascript:_e(%7B%7D,'cvml','no-reply@swift.org');> wrote:

New issue found![FAILURE] oss-lldb-incremental-linux-ubuntu-14_04 [#4018]
Build URL:
https://ci.swift.org/job/oss-lldb-incremental-linux-ubuntu-14_04/4018/
Project: oss-lldb-incremental-linux-ubuntu-14_04
Date of build: Wed, 22 Jun 2016 10:19:07 -0700
Build duration: 36 secIdentified problems:

   - Compile Error: This build failed because of a compile error. Below
   is a list of all errors in the build log:
      - Indication 1
      <https://ci.swift.org//job/oss-lldb-incremental-linux-ubuntu-14_04/4018/consoleFull#296541174ee1a197b-acac-4b17-83cf-a53b95139a76>

Changes

   - Commit *98db2cbca996177747308ef214fc6ed1b3ba6de6* by *mgottesman:*

   [cmake] Do not use LLVM's configure_lit_site_cfg to configure out lit
   - *edit*: test/CMakeLists.txt

   - Commit *7c0910a2ec487ff3ac06da50cfe2f147a95f351d* by
   *anthony.parker:*

   Address review feedback
   - *edit*: stdlib/public/SDK/Foundation/Data.swift

--
-Todd


(Todd Fiala) #3

This seems to have cleared up after a clean build. I’m guessing it was some kind of build-related change that couldn’t survive an incremental build.

We look fine now.

-Todd

···

On Jun 23, 2016, at 9:24 AM, Todd Fiala via swift-lldb-dev <swift-lldb-dev@swift.org> wrote:

Probably needs a clean build. I'll give that a shot in a minute.

On Wednesday, June 22, 2016, Tony Parker via swift-lldb-dev <swift-lldb-dev@swift.org <mailto:swift-lldb-dev@swift.org>> wrote:
CMake Error: Target section_magic_begin-linux-x86_64 has dependency information when it shouldn't.
Your cache is probably stale. Please remove the entry
  section_magic_begin-linux-x86_64_LIB_DEPENDS
from the cache.
CMake Error: Target section_magic_end-linux-x86_64 has dependency information when it shouldn't.
Your cache is probably stale. Please remove the entry
  section_magic_end-linux-x86_64_LIB_DEPENDS
from the cache.

Not sure what this means?

- Tony

On Jun 22, 2016, at 10:19 AM, no-reply@swift.org <> wrote:

New issue found!

[FAILURE] oss-lldb-incremental-linux-ubuntu-14_04 [#4018]

Build URL: https://ci.swift.org/job/oss-lldb-incremental-linux-ubuntu-14_04/4018/
Project: oss-lldb-incremental-linux-ubuntu-14_04
Date of build: Wed, 22 Jun 2016 10:19:07 -0700
Build duration: 36 sec
Identified problems:

Compile Error: This build failed because of a compile error. Below is a list of all errors in the build log:
Indication 1 <https://ci.swift.org//job/oss-lldb-incremental-linux-ubuntu-14_04/4018/consoleFull#296541174ee1a197b-acac-4b17-83cf-a53b95139a76>
Changes

Commit 98db2cbca996177747308ef214fc6ed1b3ba6de6 by mgottesman:
[cmake] Do not use LLVM's configure_lit_site_cfg to configure out lit

edit: test/CMakeLists.txt

Commit 7c0910a2ec487ff3ac06da50cfe2f147a95f351d by anthony.parker:
Address review feedback

edit: stdlib/public/SDK/Foundation/Data.swift

--
-Todd

_______________________________________________
swift-lldb-dev mailing list
swift-lldb-dev@swift.org <mailto:swift-lldb-dev@swift.org>
https://lists.swift.org/mailman/listinfo/swift-lldb-dev