[Swift CI] Build Failure: OSS - Swift Package - Ubuntu 18.04 (master) #1860

Report

[FAILURE] oss-swift-package-linux-ubuntu-18_04 [#1860]

Build URL:
https://ci.swift.org/job/oss-swift-package-linux-ubuntu-18_04/1860/
Project:
oss-swift-package-linux-ubuntu-18_04
Date of build:
Tue, 17 Sep 2019 07:30:44 -0500
Build duration:
1 hr 10 min

Changes

  • Commit 907c2eb99ba6d5f4003250f0f9377d3ed4b633e2 by suyashsrijan:
    [Typechecker] When creating the pattern binding for the backing

    • edit: lib/Sema/TypeCheckStorage.cpp
  • Commit 7ff3fd1f66f9f538399f842e74c1fcc6b34fb41b by suyashsrijan:
    [Test] Adds some tests

    • edit: test/decl/var/property_wrappers.swift
  • Commit 5a86d42c1e4b3f51e8fe612c9a62229ff2080fd0 by mgottesman:
    [gardening] Clean up BranchPropagatedUser.

    • edit: include/swift/SIL/BranchPropagatedUser.h
14:41:03 Test Case 'CompilationDatabaseTests.testJSONCompilationDatabaseCoding' started at 2019-09-17 13:41:03.822
14:41:04 Exited with signal code 4
14:41:04 /home/buildnode/jenkins/workspace/oss-swift-package-linux-ubuntu-18_04/swift-nightly-install/usr/bin/swift build --show-bin-path --package-path /home/buildnode/jenkins/workspace/oss-swift-package-linux-ubuntu-18_04/sourcekit-lsp --build-path /home/buildnode/jenkins/workspace/oss-swift-package-linux-ubuntu-18_04/build/buildbot_linux/sourcekitlsp-linux-x86_64 --configuration release -Xcxx -I -Xcxx /home/buildnode/jenkins/workspace/oss-swift-package-linux-ubuntu-18_04/swift-nightly-install/usr/lib/swift -Xcxx -I -Xcxx /home/buildnode/jenkins/workspace/oss-swift-package-linux-ubuntu-18_04/swift-nightly-install/usr/lib/swift/Block -Xlinker -rpath -Xlinker $ORIGIN/../lib/swift/linux
14:41:04 Cleaning /home/buildnode/jenkins/workspace/oss-swift-package-linux-ubuntu-18_04/build/buildbot_linux/sourcekitlsp-linux-x86_64/x86_64-unknown-linux/release/sk-tests
14:41:04 /home/buildnode/jenkins/workspace/oss-swift-package-linux-ubuntu-18_04/swift-nightly-install/usr/bin/swift test --package-path /home/buildnode/jenkins/workspace/oss-swift-package-linux-ubuntu-18_04/sourcekit-lsp --build-path /home/buildnode/jenkins/workspace/oss-swift-package-linux-ubuntu-18_04/build/buildbot_linux/sourcekitlsp-linux-x86_64 --configuration release --verbose -Xcxx -I -Xcxx /home/buildnode/jenkins/workspace/oss-swift-package-linux-ubuntu-18_04/swift-nightly-install/usr/lib/swift -Xcxx -I -Xcxx /home/buildnode/jenkins/workspace/oss-swift-package-linux-ubuntu-18_04/swift-nightly-install/usr/lib/swift/Block -Xlinker -rpath -Xlinker $ORIGIN/../lib/swift/linux
14:41:04 Traceback (most recent call last):
14:41:04   File "/home/buildnode/jenkins/workspace/oss-swift-package-linux-ubuntu-18_04/sourcekit-lsp/Utilities/build-script-helper.py", line 134, in <module>
14:41:04     main()
14:41:04   File "/home/buildnode/jenkins/workspace/oss-swift-package-linux-ubuntu-18_04/sourcekit-lsp/Utilities/build-script-helper.py", line 125, in main
14:41:04     swiftpm('test', swift_exec, swiftpm_args, env)
14:41:04   File "/home/buildnode/jenkins/workspace/oss-swift-package-linux-ubuntu-18_04/sourcekit-lsp/Utilities/build-script-helper.py", line 15, in swiftpm
14:41:04     subprocess.check_call(cmd, env=env)
14:41:04   File "/usr/lib/python2.7/subprocess.py", line 190, in check_call
14:41:04     raise CalledProcessError(retcode, cmd)
14:41:04 subprocess.CalledProcessError: Command '['/home/buildnode/jenkins/workspace/oss-swift-package-linux-ubuntu-18_04/swift-nightly-install/usr/bin/swift', 'test', '--package-path', '/home/buildnode/jenkins/workspace/oss-swift-package-linux-ubuntu-18_04/sourcekit-lsp', '--build-path', '/home/buildnode/jenkins/workspace/oss-swift-package-linux-ubuntu-18_04/build/buildbot_linux/sourcekitlsp-linux-x86_64', '--configuration', 'release', '--verbose', '-Xcxx', '-I', '-Xcxx', '/home/buildnode/jenkins/workspace/oss-swift-package-linux-ubuntu-18_04/swift-nightly-install/usr/lib/swift', '-Xcxx', '-I', '-Xcxx', '/home/buildnode/jenkins/workspace/oss-swift-package-linux-ubuntu-18_04/swift-nightly-install/usr/lib/swift/Block', '-Xlinker', '-rpath', '-Xlinker', '$ORIGIN/../lib/swift/linux']' returned non-zero exit status 1
14:41:04 Building the standard library for: swift-stdlib-linux-x86_64
14:41:04 Running Swift tests for: check-swift-all-linux-x86_64 check-swift-all-optimize-linux-x86_64
14:41:04 /home/buildnode/jenkins/workspace/oss-swift-package-linux-ubuntu-18_04/swift/utils/build-script: fatal error: command terminated with a non-zero exit status 1, aborting
14:41:04 /home/buildnode/jenkins/workspace/oss-swift-package-linux-ubuntu-18_04/swift/utils/build-script: fatal error: command terminated with a non-zero exit status 1, aborting
Terms of Service

Privacy Policy

Cookie Policy