[Swift CI] Build Failure: OSS - Swift Package - Ubuntu 16.04 (swift 3.1) #584


(Joe Shajrawi) #1

Test time out:
TestFoundation/TestProgress.swift:374: error: TestProgress.test_handlers : XCTAssertEqual failed: ("success") is not equal to ("timedOut") -
TestFoundation/TestProgress.swift:375: error: TestProgress.test_handlers : XCTAssertEqual failed: ("success") is not equal to ("timedOut") -

Regards,
—Joe |  | :e-mail: shajrawi@apple.com | :iphone:(+1) 408-930-5203

···

On May 24, 2017, at 11:37 AM, no-reply@swift.org wrote:

[FAILURE] oss-swift-3.1-package-linux-ubuntu-16_04 [#584]

Build URL: https://ci.swift.org/job/oss-swift-3.1-package-linux-ubuntu-16_04/584/
Project: oss-swift-3.1-package-linux-ubuntu-16_04
Date of build: Wed, 24 May 2017 10:39:30 -0700
Build duration: 57 min
Identified problems:

Compile Error: This build failed because of a compile error. Below is a list of all errors in the build log:
Indication 1 <https://ci.swift.org//job/oss-swift-3.1-package-linux-ubuntu-16_04/584/consoleFull#-1820264590ee1a197b-acac-4b17-83cf-a53b95139a76>
Changes

Commit b5b79f88f64835932d4faf955ebe5293c1ea7eef by Mishal Shah:
[Preset] Disable LLDB tests to unblock swift toolchains

edit: utils/build-presets.ini