[Swift CI] Build Failure: OSS - Swift Package - Ubuntu 16.04 (master) #285


(Ankit Aggarwal) #1

Looks like CI ran out of space.

···

On 22-Dec-2016, at 6:18 PM, no-reply@swift.org wrote:

[FAILURE] oss-swift-package-linux-ubuntu-16_04 [#285]

Build URL: https://ci.swift.org/job/oss-swift-package-linux-ubuntu-16_04/285/
Project: oss-swift-package-linux-ubuntu-16_04
Date of build: Thu, 22 Dec 2016 03:32:01 -0800
Build duration: 1 hr 16 min

Changes

Commit ddd4545dcba3ebf62fdd2eadcb427a80958a5fc9 by ankit_aggarwal:
[ManifestLoader] Improve error message when there is no manifest

edit: Sources/PackageModel/Package.swift
edit: Sources/Commands/Error.swift
edit: Sources/PackageLoading/ManifestLoader.swift
edit: Tests/GetTests/GetTests.swift
edit: Tests/PackageLoadingTests/ManifestTests.swift

Commit 39c0935e335338e46011be533f0b2b3e3069dd88 by ankit_aggarwal:
[Commands] Always resolve graph before edit

edit: Sources/Workspace/Workspace.swift
edit: Tests/CommandsTests/PackageToolTests.swift
edit: Sources/Commands/SwiftPackageTool.swift

Commit a2dc5beda94e18c0b4250b584628cb469ec04ecc by ankit_aggarwal:
[ArgumentParser] Throw the parser which had unexpected arguments error

edit: Sources/Commands/Error.swift
edit: Tests/UtilityTests/ArgumentParserTests.swift
edit: Sources/Utility/ArgumentParser.swift

Commit 7f8454ed955b625d238e0a05b81acccf64828947 by ankit_aggarwal:
[PackageTool] Add edit and unedit overview

edit: Sources/Commands/SwiftPackageTool.swift


(Mishal Shah) #2

Looking into it.

Thanks!
Mishal Shah

···

On Dec 22, 2016, at 8:05 PM, ankit_aggarwal@apple.com wrote:

Looks like CI ran out of space.

On 22-Dec-2016, at 6:18 PM, no-reply@swift.org wrote:

[FAILURE] oss-swift-package-linux-ubuntu-16_04 [#285]

Build URL: https://ci.swift.org/job/oss-swift-package-linux-ubuntu-16_04/285/
Project: oss-swift-package-linux-ubuntu-16_04
Date of build: Thu, 22 Dec 2016 03:32:01 -0800
Build duration: 1 hr 16 min

Changes

Commit ddd4545dcba3ebf62fdd2eadcb427a80958a5fc9 by ankit_aggarwal:
[ManifestLoader] Improve error message when there is no manifest

edit: Sources/PackageModel/Package.swift
edit: Sources/Commands/Error.swift
edit: Sources/PackageLoading/ManifestLoader.swift
edit: Tests/GetTests/GetTests.swift
edit: Tests/PackageLoadingTests/ManifestTests.swift

Commit 39c0935e335338e46011be533f0b2b3e3069dd88 by ankit_aggarwal:
[Commands] Always resolve graph before edit

edit: Sources/Workspace/Workspace.swift
edit: Tests/CommandsTests/PackageToolTests.swift
edit: Sources/Commands/SwiftPackageTool.swift

Commit a2dc5beda94e18c0b4250b584628cb469ec04ecc by ankit_aggarwal:
[ArgumentParser] Throw the parser which had unexpected arguments error

edit: Sources/Commands/Error.swift
edit: Tests/UtilityTests/ArgumentParserTests.swift
edit: Sources/Utility/ArgumentParser.swift

Commit 7f8454ed955b625d238e0a05b81acccf64828947 by ankit_aggarwal:
[PackageTool] Add edit and unedit overview

edit: Sources/Commands/SwiftPackageTool.swift


(Mishal Shah) #3

Fixed.

Mishal Shah

···

On Dec 22, 2016, at 8:05 PM, ankit_aggarwal@apple.com wrote:

Looks like CI ran out of space.

On 22-Dec-2016, at 6:18 PM, no-reply@swift.org <mailto:no-reply@swift.org> wrote:

[FAILURE] oss-swift-package-linux-ubuntu-16_04 [#285]

Build URL: https://ci.swift.org/job/oss-swift-package-linux-ubuntu-16_04/285/
Project: oss-swift-package-linux-ubuntu-16_04
Date of build: Thu, 22 Dec 2016 03:32:01 -0800
Build duration: 1 hr 16 min

Changes

Commit ddd4545dcba3ebf62fdd2eadcb427a80958a5fc9 by ankit_aggarwal:
[ManifestLoader] Improve error message when there is no manifest

edit: Sources/PackageModel/Package.swift
edit: Sources/Commands/Error.swift
edit: Sources/PackageLoading/ManifestLoader.swift
edit: Tests/GetTests/GetTests.swift
edit: Tests/PackageLoadingTests/ManifestTests.swift

Commit 39c0935e335338e46011be533f0b2b3e3069dd88 by ankit_aggarwal:
[Commands] Always resolve graph before edit

edit: Sources/Workspace/Workspace.swift
edit: Tests/CommandsTests/PackageToolTests.swift
edit: Sources/Commands/SwiftPackageTool.swift

Commit a2dc5beda94e18c0b4250b584628cb469ec04ecc by ankit_aggarwal:
[ArgumentParser] Throw the parser which had unexpected arguments error

edit: Sources/Commands/Error.swift
edit: Tests/UtilityTests/ArgumentParserTests.swift
edit: Sources/Utility/ArgumentParser.swift

Commit 7f8454ed955b625d238e0a05b81acccf64828947 by ankit_aggarwal:
[PackageTool] Add edit and unedit overview

edit: Sources/Commands/SwiftPackageTool.swift