[Swift CI] Build Failure: OSS - Swift Package - Ubuntu 15.10 (master) #1783


(Andrew Trick) #1

This fails periodically:

[TestIndirectEnumVariables.py FAILED]

It’s definitely not my commit, which passed linux CI multiple times.
-Andy

···

On Jul 27, 2016, at 11:13 AM, no-reply@swift.org wrote:

[FAILURE] oss-swift-package-linux-ubuntu-15_10 [#1783]

Build URL: https://ci.swift.org/job/oss-swift-package-linux-ubuntu-15_10/1783/
Project: oss-swift-package-linux-ubuntu-15_10
Date of build: Wed, 27 Jul 2016 10:43:15 -0700
Build duration: 30 min
Identified problems:

Regression test failed: This build failed because a regression test in the test suite FAILed. Below is a list of all errors:
Indication 1 <https://ci.swift.org//job/oss-swift-package-linux-ubuntu-15_10/1783/consoleFull#1588343159fca400bf-2f4a-462e-b517-e058d770b2d7>
Changes

Commit ea693dd8d1fcf699f9bd2237562aa7e27990f8da by gribozavr:
Add AnyHashable support for Foundation.Decimal

edit: stdlib/public/SDK/Foundation/Foundation.swift
add: validation-test/stdlib/NSDecimalNumberBridging.swift.gyb
edit: stdlib/public/SDK/Foundation/TypePreservingNSNumber.mm

Commit 37b789007de381e533de104d80fcb637e59ece89 by aschwaighofer:
Disable Dictionary/Set.swift tests that fail in optimize mode

edit: validation-test/stdlib/Dictionary.swift
edit: validation-test/stdlib/Set.swift

Commit 37c084bbebdcf6a46ae1e96369b95d4f4d9dac17 by atrick:
Use UnsafeMutableRawPointer in HashedCollection

edit: stdlib/public/core/HashedCollections.swift.gyb

Commit c12552860019984c75c44dc0bd3617bce650b706 by atrick:
Use a `UnsafeMutableRawPointer` in SwiftNativeNSArray.getObjects()

edit: stdlib/public/core/SwiftNativeNSArray.swift

Commit 2e0dd7b046486934abe024668ea7fdb34dde7ea8 by atrick:
Use UnsafeRawPointer in withArrayOfCStrings.

edit: stdlib/private/SwiftPrivate/SwiftPrivate.swift

Commit 3e2372b6a381c09af040752746e47bba4f30f77a by atrick:
Use UnsafeRawPointer in GLKit _indexHomogeneousValue.

edit: stdlib/public/SDK/GLKit/GLKit.swift.gyb

Commit 108c102c54ff7ca5480881df969030d80c4aebd6 by rjmccall:
Fix test for precedence groups.

edit: validation-test/stdlib/MicroStdlib/Inputs/Swift.swift
edit: validation-test/stdlib/MicroStdlib/MicroStdlib.swift

Commit 9886e4ef54e1b50f95d18a27908196658c0ff97c by atrick:
Use UnsafeRawPointer in StringCore.

edit: stdlib/public/SDK/GLKit/GLKit.swift.gyb
edit: test/1_stdlib/NewString.swift
edit: test/1_stdlib/NewStringAppending.swift
edit: stdlib/public/core/String.swift
edit: stdlib/public/core/Character.swift
edit: stdlib/public/core/StringUnicodeScalarView.swift
edit: stdlib/public/core/Runtime.swift.gyb
edit: stdlib/public/core/UnsafePointer.swift.gyb
edit: stdlib/public/core/StringCore.swift
edit: stdlib/public/core/StringUTF8.swift
edit: stdlib/public/core/StringBuffer.swift
edit: stdlib/public/core/StringBridge.swift

Commit 3e0f922d9a50bce663d01e4d702cd242557d7021 by ankit.spd:
[PackageModel] Change ClangModule baseclass to Module

edit: Sources/Build/Buildable.swift
edit: Sources/Build/Command.compile(ClangModule).swift
edit: Sources/PackageGraph/PackageGraphLoader.swift
edit: Sources/PackageModel/Module.swift
edit: Sources/Build/describe().swift
edit: Sources/Xcodeproj/Module+PBXProj.swift
edit: Sources/PackageLoading/ModuleMapGeneration.swift

Commit 790d4b5e78fadbcc54011f4dc35de2a42ccc1497 by ankit.spd:
[PackageLoading] Remove unnecessary if condition

edit: Sources/PackageLoading/PackageBuilder.swift

Commit 7eeb64a3360475c0c9e4231f9b4f3c7f4174c0d1 by ankit.spd:
[PackageLoadingTests] Increase PackageBuilder unit test coverage

edit: Tests/PackageLoading/ConventionTests.swift

Commit 23d8c74abf1e6bb8c76b3a85d23358e985328474 by ankit.spd:
[PackageModel] Make product type equatable

edit: Sources/PackageModel/Product.swift

Commit 41e4f5642ef4aa2d118c8790b2e7c583ada7bcbb by ankit.spd:
[PackageBuilderTests] Test products

edit: Tests/PackageLoading/ConventionTests.swift

Commit 77ef84bbd1eb80c6477f2a6c3940f6edbd06031c by ankit.spd:
[PackageBuilderTests] Add a missing target dependency testcase

edit: Tests/PackageLoading/ConventionTests.swift

Commit 0621ebc77d8ee6991e63b3d4934ba42de1b41a02 by github:
Update tests for SE-0025 ('private' and 'fileprivate') (#37)

edit: packages/Python/lldbsuite/test/lang/swift/partially_generic_func/continuations/main.swift
edit: packages/Python/lldbsuite/test/lang/swift/private_self/main.swift
edit: packages/Python/lldbsuite/test/lang/swift/private_typealias/main.swift
edit: packages/Python/lldbsuite/test/lang/swift/cross_module_extension/moda.swift
edit: packages/Python/lldbsuite/test/lang/swift/private_decl_name/a.swift
edit: packages/Python/lldbsuite/test/lang/swift/cross_module_extension/modb.swift
edit: packages/Python/lldbsuite/test/lang/swift/resilience/mod.b.swift
edit: packages/Python/lldbsuite/test/lang/swift/private_decl_name/b.swift


(Mishal Shah) #2

+Todd

Hi Todd,

Can you please look at this failure? Not sure, why its failing now.

ERROR: [EXCEPTIONAL EXIT 11 (SIGSEGV)] test_indirect_enum_variables_gmodules (lang/swift/variables/indirect_enums/TestIndirectEnumVariables.py)

Thanks!
Mishal Shah

···

On Jul 27, 2016, at 11:22 AM, Andrew Trick <atrick@apple.com> wrote:

This fails periodically:

[TestIndirectEnumVariables.py FAILED]

It’s definitely not my commit, which passed linux CI multiple times.
-Andy

On Jul 27, 2016, at 11:13 AM, no-reply@swift.org <mailto:no-reply@swift.org> wrote:

[FAILURE] oss-swift-package-linux-ubuntu-15_10 [#1783]

Build URL: https://ci.swift.org/job/oss-swift-package-linux-ubuntu-15_10/1783/
Project: oss-swift-package-linux-ubuntu-15_10
Date of build: Wed, 27 Jul 2016 10:43:15 -0700
Build duration: 30 min
Identified problems:

Regression test failed: This build failed because a regression test in the test suite FAILed. Below is a list of all errors:
Indication 1 <https://ci.swift.org//job/oss-swift-package-linux-ubuntu-15_10/1783/consoleFull#1588343159fca400bf-2f4a-462e-b517-e058d770b2d7>
Changes

Commit ea693dd8d1fcf699f9bd2237562aa7e27990f8da by gribozavr:
Add AnyHashable support for Foundation.Decimal

edit: stdlib/public/SDK/Foundation/Foundation.swift
add: validation-test/stdlib/NSDecimalNumberBridging.swift.gyb
edit: stdlib/public/SDK/Foundation/TypePreservingNSNumber.mm

Commit 37b789007de381e533de104d80fcb637e59ece89 by aschwaighofer:
Disable Dictionary/Set.swift tests that fail in optimize mode

edit: validation-test/stdlib/Dictionary.swift
edit: validation-test/stdlib/Set.swift

Commit 37c084bbebdcf6a46ae1e96369b95d4f4d9dac17 by atrick:
Use UnsafeMutableRawPointer in HashedCollection

edit: stdlib/public/core/HashedCollections.swift.gyb

Commit c12552860019984c75c44dc0bd3617bce650b706 by atrick:
Use a `UnsafeMutableRawPointer` in SwiftNativeNSArray.getObjects()

edit: stdlib/public/core/SwiftNativeNSArray.swift

Commit 2e0dd7b046486934abe024668ea7fdb34dde7ea8 by atrick:
Use UnsafeRawPointer in withArrayOfCStrings.

edit: stdlib/private/SwiftPrivate/SwiftPrivate.swift

Commit 3e2372b6a381c09af040752746e47bba4f30f77a by atrick:
Use UnsafeRawPointer in GLKit _indexHomogeneousValue.

edit: stdlib/public/SDK/GLKit/GLKit.swift.gyb

Commit 108c102c54ff7ca5480881df969030d80c4aebd6 by rjmccall:
Fix test for precedence groups.

edit: validation-test/stdlib/MicroStdlib/Inputs/Swift.swift
edit: validation-test/stdlib/MicroStdlib/MicroStdlib.swift

Commit 9886e4ef54e1b50f95d18a27908196658c0ff97c by atrick:
Use UnsafeRawPointer in StringCore.

edit: stdlib/public/SDK/GLKit/GLKit.swift.gyb
edit: test/1_stdlib/NewString.swift
edit: test/1_stdlib/NewStringAppending.swift
edit: stdlib/public/core/String.swift
edit: stdlib/public/core/Character.swift
edit: stdlib/public/core/StringUnicodeScalarView.swift
edit: stdlib/public/core/Runtime.swift.gyb
edit: stdlib/public/core/UnsafePointer.swift.gyb
edit: stdlib/public/core/StringCore.swift
edit: stdlib/public/core/StringUTF8.swift
edit: stdlib/public/core/StringBuffer.swift
edit: stdlib/public/core/StringBridge.swift

Commit 3e0f922d9a50bce663d01e4d702cd242557d7021 by ankit.spd:
[PackageModel] Change ClangModule baseclass to Module

edit: Sources/Build/Buildable.swift
edit: Sources/Build/Command.compile(ClangModule).swift
edit: Sources/PackageGraph/PackageGraphLoader.swift
edit: Sources/PackageModel/Module.swift
edit: Sources/Build/describe().swift
edit: Sources/Xcodeproj/Module+PBXProj.swift
edit: Sources/PackageLoading/ModuleMapGeneration.swift

Commit 790d4b5e78fadbcc54011f4dc35de2a42ccc1497 by ankit.spd:
[PackageLoading] Remove unnecessary if condition

edit: Sources/PackageLoading/PackageBuilder.swift

Commit 7eeb64a3360475c0c9e4231f9b4f3c7f4174c0d1 by ankit.spd:
[PackageLoadingTests] Increase PackageBuilder unit test coverage

edit: Tests/PackageLoading/ConventionTests.swift

Commit 23d8c74abf1e6bb8c76b3a85d23358e985328474 by ankit.spd:
[PackageModel] Make product type equatable

edit: Sources/PackageModel/Product.swift

Commit 41e4f5642ef4aa2d118c8790b2e7c583ada7bcbb by ankit.spd:
[PackageBuilderTests] Test products

edit: Tests/PackageLoading/ConventionTests.swift

Commit 77ef84bbd1eb80c6477f2a6c3940f6edbd06031c by ankit.spd:
[PackageBuilderTests] Add a missing target dependency testcase

edit: Tests/PackageLoading/ConventionTests.swift

Commit 0621ebc77d8ee6991e63b3d4934ba42de1b41a02 by github:
Update tests for SE-0025 ('private' and 'fileprivate') (#37)

edit: packages/Python/lldbsuite/test/lang/swift/partially_generic_func/continuations/main.swift
edit: packages/Python/lldbsuite/test/lang/swift/private_self/main.swift
edit: packages/Python/lldbsuite/test/lang/swift/private_typealias/main.swift
edit: packages/Python/lldbsuite/test/lang/swift/cross_module_extension/moda.swift
edit: packages/Python/lldbsuite/test/lang/swift/private_decl_name/a.swift
edit: packages/Python/lldbsuite/test/lang/swift/cross_module_extension/modb.swift
edit: packages/Python/lldbsuite/test/lang/swift/resilience/mod.b.swift
edit: packages/Python/lldbsuite/test/lang/swift/private_decl_name/b.swift


(Mishal Shah) #3

Adding Todd.

···

On Jul 27, 2016, at 11:25 AM, Mishal Shah via swift-dev <swift-dev@swift.org> wrote:

+Todd

Hi Todd,

Can you please look at this failure? Not sure, why its failing now.

ERROR: [EXCEPTIONAL EXIT 11 (SIGSEGV)] test_indirect_enum_variables_gmodules (lang/swift/variables/indirect_enums/TestIndirectEnumVariables.py)

Thanks!
Mishal Shah

On Jul 27, 2016, at 11:22 AM, Andrew Trick <atrick@apple.com <mailto:atrick@apple.com>> wrote:

This fails periodically:

[TestIndirectEnumVariables.py FAILED]

It’s definitely not my commit, which passed linux CI multiple times.
-Andy

On Jul 27, 2016, at 11:13 AM, no-reply@swift.org <mailto:no-reply@swift.org> wrote:

[FAILURE] oss-swift-package-linux-ubuntu-15_10 [#1783]

Build URL: https://ci.swift.org/job/oss-swift-package-linux-ubuntu-15_10/1783/
Project: oss-swift-package-linux-ubuntu-15_10
Date of build: Wed, 27 Jul 2016 10:43:15 -0700
Build duration: 30 min
Identified problems:

Regression test failed: This build failed because a regression test in the test suite FAILed. Below is a list of all errors:
Indication 1 <https://ci.swift.org//job/oss-swift-package-linux-ubuntu-15_10/1783/consoleFull#1588343159fca400bf-2f4a-462e-b517-e058d770b2d7>
Changes

Commit ea693dd8d1fcf699f9bd2237562aa7e27990f8da by gribozavr:
Add AnyHashable support for Foundation.Decimal

edit: stdlib/public/SDK/Foundation/Foundation.swift
add: validation-test/stdlib/NSDecimalNumberBridging.swift.gyb
edit: stdlib/public/SDK/Foundation/TypePreservingNSNumber.mm

Commit 37b789007de381e533de104d80fcb637e59ece89 by aschwaighofer:
Disable Dictionary/Set.swift tests that fail in optimize mode

edit: validation-test/stdlib/Dictionary.swift
edit: validation-test/stdlib/Set.swift

Commit 37c084bbebdcf6a46ae1e96369b95d4f4d9dac17 by atrick:
Use UnsafeMutableRawPointer in HashedCollection

edit: stdlib/public/core/HashedCollections.swift.gyb

Commit c12552860019984c75c44dc0bd3617bce650b706 by atrick:
Use a `UnsafeMutableRawPointer` in SwiftNativeNSArray.getObjects()

edit: stdlib/public/core/SwiftNativeNSArray.swift

Commit 2e0dd7b046486934abe024668ea7fdb34dde7ea8 by atrick:
Use UnsafeRawPointer in withArrayOfCStrings.

edit: stdlib/private/SwiftPrivate/SwiftPrivate.swift

Commit 3e2372b6a381c09af040752746e47bba4f30f77a by atrick:
Use UnsafeRawPointer in GLKit _indexHomogeneousValue.

edit: stdlib/public/SDK/GLKit/GLKit.swift.gyb

Commit 108c102c54ff7ca5480881df969030d80c4aebd6 by rjmccall:
Fix test for precedence groups.

edit: validation-test/stdlib/MicroStdlib/Inputs/Swift.swift
edit: validation-test/stdlib/MicroStdlib/MicroStdlib.swift

Commit 9886e4ef54e1b50f95d18a27908196658c0ff97c by atrick:
Use UnsafeRawPointer in StringCore.

edit: stdlib/public/SDK/GLKit/GLKit.swift.gyb
edit: test/1_stdlib/NewString.swift
edit: test/1_stdlib/NewStringAppending.swift
edit: stdlib/public/core/String.swift
edit: stdlib/public/core/Character.swift
edit: stdlib/public/core/StringUnicodeScalarView.swift
edit: stdlib/public/core/Runtime.swift.gyb
edit: stdlib/public/core/UnsafePointer.swift.gyb
edit: stdlib/public/core/StringCore.swift
edit: stdlib/public/core/StringUTF8.swift
edit: stdlib/public/core/StringBuffer.swift
edit: stdlib/public/core/StringBridge.swift

Commit 3e0f922d9a50bce663d01e4d702cd242557d7021 by ankit.spd:
[PackageModel] Change ClangModule baseclass to Module

edit: Sources/Build/Buildable.swift
edit: Sources/Build/Command.compile(ClangModule).swift
edit: Sources/PackageGraph/PackageGraphLoader.swift
edit: Sources/PackageModel/Module.swift
edit: Sources/Build/describe().swift
edit: Sources/Xcodeproj/Module+PBXProj.swift
edit: Sources/PackageLoading/ModuleMapGeneration.swift

Commit 790d4b5e78fadbcc54011f4dc35de2a42ccc1497 by ankit.spd:
[PackageLoading] Remove unnecessary if condition

edit: Sources/PackageLoading/PackageBuilder.swift

Commit 7eeb64a3360475c0c9e4231f9b4f3c7f4174c0d1 by ankit.spd:
[PackageLoadingTests] Increase PackageBuilder unit test coverage

edit: Tests/PackageLoading/ConventionTests.swift

Commit 23d8c74abf1e6bb8c76b3a85d23358e985328474 by ankit.spd:
[PackageModel] Make product type equatable

edit: Sources/PackageModel/Product.swift

Commit 41e4f5642ef4aa2d118c8790b2e7c583ada7bcbb by ankit.spd:
[PackageBuilderTests] Test products

edit: Tests/PackageLoading/ConventionTests.swift

Commit 77ef84bbd1eb80c6477f2a6c3940f6edbd06031c by ankit.spd:
[PackageBuilderTests] Add a missing target dependency testcase

edit: Tests/PackageLoading/ConventionTests.swift

Commit 0621ebc77d8ee6991e63b3d4934ba42de1b41a02 by github:
Update tests for SE-0025 ('private' and 'fileprivate') (#37)

edit: packages/Python/lldbsuite/test/lang/swift/partially_generic_func/continuations/main.swift
edit: packages/Python/lldbsuite/test/lang/swift/private_self/main.swift
edit: packages/Python/lldbsuite/test/lang/swift/private_typealias/main.swift
edit: packages/Python/lldbsuite/test/lang/swift/cross_module_extension/moda.swift
edit: packages/Python/lldbsuite/test/lang/swift/private_decl_name/a.swift
edit: packages/Python/lldbsuite/test/lang/swift/cross_module_extension/modb.swift
edit: packages/Python/lldbsuite/test/lang/swift/resilience/mod.b.swift
edit: packages/Python/lldbsuite/test/lang/swift/private_decl_name/b.swift

_______________________________________________
swift-dev mailing list
swift-dev@swift.org
https://lists.swift.org/mailman/listinfo/swift-dev