[Swift CI] Build Failure: OSS - Swift Package - Ubuntu 15.10 (master) #1606


(Ben Langmuir) #1

Looks like it timed out. Happened a few builds ago too:
https://ci.swift.org/job/oss-swift-package-linux-ubuntu-15_10/1597

******************** TEST 'swift-package-tests :: repl/test-repl-glibc.py' FAILED ********************
Script:

···

--
rm -rf /home/buildnode/jenkins/workspace/oss-swift-package-linux-ubuntu-15_10/build/buildbot_linux/none-swift_package_sandbox_linux-x86_64/tests/repl/Output/test-repl-glibc.py.tmp.dir
mkdir /home/buildnode/jenkins/workspace/oss-swift-package-linux-ubuntu-15_10/build/buildbot_linux/none-swift_package_sandbox_linux-x86_64/tests/repl/Output/test-repl-glibc.py.tmp.dir
python /home/buildnode/jenkins/workspace/oss-swift-package-linux-ubuntu-15_10/swift-integration-tests/repl/test-repl-glibc.py /home/buildnode/jenkins/workspace/oss-swift-package-linux-ubuntu-15_10/build/buildbot_linux/none-swift_package_sandbox_linux-x86_64/usr/bin/swift > /home/buildnode/jenkins/workspace/oss-swift-package-linux-ubuntu-15_10/build/buildbot_linux/none-swift_package_sandbox_linux-x86_64/tests/repl/Output/test-repl-glibc.py.tmp.dir/output.txt
/home/buildnode/jenkins/workspace/oss-swift-package-linux-ubuntu-15_10/build/buildbot_linux/llvm-linux-x86_64/bin/FileCheck --input-file /home/buildnode/jenkins/workspace/oss-swift-package-linux-ubuntu-15_10/build/buildbot_linux/none-swift_package_sandbox_linux-x86_64/tests/repl/Output/test-repl-glibc.py.tmp.dir/output.txt /home/buildnode/jenkins/workspace/oss-swift-package-linux-ubuntu-15_10/swift-integration-tests/repl/test-repl-glibc.py
--
Exit Code: 1

Command Output (stdout):
--
Command 0: "rm" "-rf" "/home/buildnode/jenkins/workspace/oss-swift-package-linux-ubuntu-15_10/build/buildbot_linux/none-swift_package_sandbox_linux-x86_64/tests/repl/Output/test-repl-glibc.py.tmp.dir"
Command 0 Result: 0
Command 0 Output:

Command 0 Stderr:

Command 1: "mkdir" "/home/buildnode/jenkins/workspace/oss-swift-package-linux-ubuntu-15_10/build/buildbot_linux/none-swift_package_sandbox_linux-x86_64/tests/repl/Output/test-repl-glibc.py.tmp.dir"
Command 1 Result: 0
Command 1 Output:

Command 1 Stderr:

Command 2: "python" "/home/buildnode/jenkins/workspace/oss-swift-package-linux-ubuntu-15_10/swift-integration-tests/repl/test-repl-glibc.py" "/home/buildnode/jenkins/workspace/oss-swift-package-linux-ubuntu-15_10/build/buildbot_linux/none-swift_package_sandbox_linux-x86_64/usr/bin/swift"
Command 2 Result: 1
Command 2 Output:
None

Command 2 Stderr:
Traceback (most recent call last):
  File "/home/buildnode/jenkins/workspace/oss-swift-package-linux-ubuntu-15_10/swift-integration-tests/repl/test-repl-glibc.py", line 51, in <module>
    repl.expect("init")
  File "/usr/lib/python2.7/dist-packages/pexpect/__init__.py", line 1418, in expect
    timeout, searchwindowsize)
  File "/usr/lib/python2.7/dist-packages/pexpect/__init__.py", line 1433, in expect_list
    timeout, searchwindowsize)
  File "/usr/lib/python2.7/dist-packages/pexpect/__init__.py", line 1535, in expect_loop
    raise TIMEOUT(str(err) + '\n' + str(self))
pexpect.TIMEOUT: Timeout exceeded.
<pexpect.spawn object at 0x7f5743e511d0>
version: 3.2
command: /home/buildnode/jenkins/workspace/oss-swift-package-linux-ubuntu-15_10/build/buildbot_linux/none-swift_package_sandbox_linux-x86_64/usr/bin/swift
args: ['/home/buildnode/jenkins/workspace/oss-swift-package-linux-ubuntu-15_10/build/buildbot_linux/none-swift_package_sandbox_linux-x86_64/usr/bin/swift']
searcher: <pexpect.searcher_re object at 0x7f5743e51210>
buffer (last 100 chars): 'expected expression\r\n:type lookup FILE\r\n^\r\n\r\n\r\n\x1b[1G\x1b[J\x1b[2m 2> \x1b[22m \x1b[1G 2> \x1b[1G\x1b[2m 2> \x1b[22m\x1b[6G'
before (last 100 chars): 'expected expression\r\n:type lookup FILE\r\n^\r\n\r\n\r\n\x1b[1G\x1b[J\x1b[2m 2> \x1b[22m \x1b[1G 2> \x1b[1G\x1b[2m 2> \x1b[22m\x1b[6G'
after: <class 'pexpect.TIMEOUT'>
match: None
match_index: None
exitstatus: None
flag_eof: False
pid: 22026
child_fd: 3
closed: False
timeout: 30
delimiter: <class 'pexpect.EOF'>
logfile: None
logfile_read: None
logfile_send: None
maxread: 2000
ignorecase: False
searchwindowsize: None
delaybeforesend: 0.05
delayafterclose: 0.1
delayafterterminate: 0.1

On Jul 1, 2016, at 3:51 PM, no-reply@swift.org wrote:

[FAILURE] oss-swift-package-linux-ubuntu-15_10 [#1606]

Build URL: https://ci.swift.org/job/oss-swift-package-linux-ubuntu-15_10/1606/
Project: oss-swift-package-linux-ubuntu-15_10
Date of build: Fri, 01 Jul 2016 15:06:23 -0700
Build duration: 45 min
Identified problems:

Regression test failed: This build failed because a regression test in the test suite FAILed. Below is a list of all errors:
Indication 1 <https://ci.swift.org//job/oss-swift-package-linux-ubuntu-15_10/1606/consoleFull#-1858249540fca400bf-2f4a-462e-b517-e058d770b2d7>
Changes

Commit 83901998c91f9242a133aab9721ede483e6b645e by compnerd:
Port for PS4

edit: stdlib/private/SwiftPrivateLibcExtras/SwiftPrivateLibcExtras.swift
edit: lib/Basic/LangOptions.cpp
add: test/IRGen/autolink-psei.swift
edit: lib/IRGen/IRGenModule.cpp
edit: stdlib/private/SwiftPrivateLibcExtras/Subprocess.swift
edit: test/Interpreter/SDK/libc.swift
edit: stdlib/public/Platform/tgmath.swift.gyb
edit: stdlib/private/StdlibUnittest/StdlibUnittest.swift.gyb
edit: validation-test/StdlibUnittest/Stdin.swift
edit: validation-test/StdlibUnittest/ChildProcessShutdown/FailIfChildExitsDuringShutdown.swift
edit: stdlib/private/StdlibUnittest/StdlibCoreExtras.swift
edit: validation-test/stdlib/String.swift
edit: lib/Basic/Platform.cpp
add: test/Parse/ConditionalCompilation/x86_64PS4Target.swift
edit: stdlib/private/StdlibUnittest/RaceTest.swift
edit: test/1_stdlib/PrintFloat.swift
edit: include/swift/Basic/LangOptions.h
edit: test/1_stdlib/tgmath.swift
add: validation-test/StdlibUnittest/PS4.swift
edit: validation-test/StdlibUnittest/ChildProcessShutdown/FailIfChildCrashesDuringShutdown.swift
edit: validation-test/StdlibUnittest/ChildProcessShutdown/PassIfChildCrashedDuringTestExecution.swift
edit: stdlib/private/SwiftPrivatePthreadExtras/SwiftPrivatePthreadExtras.swift
edit: stdlib/public/Platform/Platform.swift
edit: stdlib/private/SwiftPrivatePthreadExtras/PthreadBarriers.swift
edit: test/1_stdlib/tgmath_optimized.swift

Commit 6ef62f3c7357caa288bc97ba320b9c1a5dec51d8 by fs.output:
[stdlib] Better diagnosis for unavailable APIs

edit: stdlib/public/core/Filter.swift.gyb
edit: stdlib/public/core/RangeReplaceableCollection.swift.gyb
add: test/1_stdlib/Renames.swift
edit: stdlib/public/core/Sequence.swift
edit: stdlib/public/core/ExistentialCollection.swift.gyb
edit: stdlib/public/core/SetAlgebra.swift
edit: stdlib/public/core/Repeat.swift
add: test/1_stdlib/RenamesObjC.swift
edit: stdlib/public/core/Join.swift
edit: stdlib/public/core/UnicodeScalar.swift
edit: stdlib/public/core/CollectionOfOne.swift
edit: stdlib/public/core/EmptyCollection.swift
edit: stdlib/public/core/SequenceAlgorithms.swift.gyb
edit: stdlib/public/core/CollectionAlgorithms.swift.gyb
edit: stdlib/public/core/Collection.swift
edit: stdlib/public/core/LazySequence.swift
edit: stdlib/public/core/Print.swift
edit: stdlib/public/core/Unicode.swift
edit: stdlib/public/core/OutputStream.swift
edit: stdlib/public/core/UnsafePointer.swift.gyb
edit: stdlib/public/core/HashedCollections.swift.gyb
edit: stdlib/public/core/Arrays.swift.gyb
edit: stdlib/public/core/Reverse.swift
edit: stdlib/public/core/String.swift
edit: stdlib/public/core/Flatten.swift.gyb

Commit b4d305905163f4c0f09658dc4041b8646cc68ba5 by aprantl:
Debug Info: Unique forward declarations generated for scopes and types.

edit: lib/IRGen/IRGenDebugInfo.cpp
edit: lib/IRGen/IRGenDebugInfo.h
add: test/DebugInfo/parent-scope.swift

Commit 1ad666742e6c81d90e7692a5ca64bc4227f97db4 by gribozavr:
tests: fix coding style

edit: test/Parse/ConditionalCompilation/x86_64PS4Target.swift

Commit c8f7da4de1a1eae8f977d92622dcdff8fa251f8e by blangmuir:
[CodeCompletion] Support a narrow case for producing trailing closures

edit: lib/AST/Type.cpp
edit: lib/IDE/CodeCompletionResultBuilder.h
add: test/IDE/complete_trailing_closure.swift
edit: tools/SourceKit/lib/SwiftLang/CodeCompletionOrganizer.cpp
edit: lib/Sema/ConstraintSystem.h
edit: include/swift/AST/Types.h
edit: lib/IDE/CodeCompletion.cpp
edit: lib/Sema/CSSimplify.cpp

Commit 40fc91bf4dd124311e42a785342580c3d1a52dc5 by konstantin.koval1:
use Git.tool instead of hardcoded "git"

edit: Tests/Functional/Utilities.swift
edit: Tests/Utility/GitTests.swift
edit: Tests/Functional/MiscellaneousTests.swift
edit: Tests/Get/GetTests.swift