[Swift CI] Build Failure: OSS - Swift Package - Ubuntu 14.04 (swift 3.1) #737


(Mamatha Busi) #1

Not sure how the changes to URLSession and HTTPCookieStorage is impacting the swiftpm test failure:

Build timed out (after 30 minutes). Marking the build as failed.
Build was aborted
/home/buildnode/disk2/workspace/oss-swift-3.1-package-linux-ubuntu-14_04/swiftpm/Tests/UtilityTests/InterruptHandlerTests.swift:29: error: InterruptHandlerTests.testBasics : XCTAssertEqual failed: ("") is not equal to ("Hello from handler!

Could you please take a look.

Thanks.

-Mamatha

-----no-reply@swift.org wrote: -----

···

To: mamabusi@in.ibm.com
From: no-reply@swift.org
Date: 05/30/2017 01:53PM
Cc: mishal_shah@apple.com, shajrawi@apple.com
Subject: [Swift CI] Build Failure: OSS - Swift Package - Ubuntu 14.04 (swift 3.1) #737

[FAILURE] oss-swift-3.1-package-linux-ubuntu-14_04 [#737]

Build URL:
https://ci.swift.org/job/oss-swift-3.1-package-linux-ubuntu-14_04/737/
Project:
oss-swift-3.1-package-linux-ubuntu-14_04
Date of build:
Tue, 30 May 2017 00:07:27 -0700
Build duration:
1 hr 16 min

Identified problems:

  • Compile Error: This build failed because of a compile error. Below is a list of all errors in the build log:
  • Timeout: This build was marked as FAIL because it timed out.

Changes

  • Commit a8be80ea620776b8e203415a645314057d273bc0 by “saiHemak”:
    URLRequest.timeoutInterval should override the URLSession.configuration

    • edit: Foundation/NSURLSession/NSURLSessionTask.swift
    • edit: Foundation/URLRequest.swift
    • edit: TestFoundation/TestNSURLSession.swift
  • Commit 062ab24ac807b65bac72bb9559bad827d9f6a354 by Mamatha Busi:
    Separate cookieStorage by application

    • edit: TestFoundation/TestNSHTTPCookieStorage.swift
    • edit: TestFoundation/XDGTestHelper.swift
    • edit: Foundation/NSHTTPCookieStorage.swift

Hi


(Ankit Aggarwal) #2

Looks like this test hangs sometimes. I'll disable it for now and investigate. Next build should pass.

···

On 30-May-2017, at 5:14 PM, Mamatha Busi <mamabusi@in.ibm.com> wrote:

Hi

Not sure how the changes to URLSession and HTTPCookieStorage is impacting the swiftpm test failure:

Build timed out (after 30 minutes). Marking the build as failed.
Build was aborted
<>/home/buildnode/disk2/workspace/oss-swift-3.1-package-linux-ubuntu-14_04/swiftpm/Tests/UtilityTests/InterruptHandlerTests.swift:29: error: InterruptHandlerTests.testBasics : XCTAssertEqual failed: ("") is not equal to ("Hello from handler!

Could you please take a look.
Thanks.

-Mamatha

-----no-reply@swift.org <mailto:-----no-reply@swift.org> wrote: -----
To: mamabusi@in.ibm.com <mailto:mamabusi@in.ibm.com>
From: no-reply@swift.org <mailto:no-reply@swift.org>
Date: 05/30/2017 01:53PM
Cc: mishal_shah@apple.com <mailto:mishal_shah@apple.com>, shajrawi@apple.com <mailto:shajrawi@apple.com>
Subject: [Swift CI] Build Failure: OSS - Swift Package - Ubuntu 14.04 (swift 3.1) #737

[FAILURE] oss-swift-3.1-package-linux-ubuntu-14_04 [#737]

Build URL: https://ci.swift.org/job/oss-swift-3.1-package-linux-ubuntu-14_04/737/
Project: oss-swift-3.1-package-linux-ubuntu-14_04
Date of build: Tue, 30 May 2017 00:07:27 -0700
Build duration: 1 hr 16 min
Identified problems:

Compile Error: This build failed because of a compile error. Below is a list of all errors in the build log:
Indication 1 <https://ci.swift.org//job/oss-swift-3.1-package-linux-ubuntu-14_04/737/consoleFull#-25622626ee1a197b-acac-4b17-83cf-a53b95139a76>
Timeout: This build was marked as FAIL because it timed out.
Indication 1 <https://ci.swift.org//job/oss-swift-3.1-package-linux-ubuntu-14_04/737/consoleFull#-18214046556633f0f-8823-4f82-9a4a-0c0d97ce7760>
Changes

Commit a8be80ea620776b8e203415a645314057d273bc0 by “saiHemak”:
URLRequest.timeoutInterval should override the URLSession.configuration

edit: Foundation/NSURLSession/NSURLSessionTask.swift
edit: Foundation/URLRequest.swift
edit: TestFoundation/TestNSURLSession.swift

Commit 062ab24ac807b65bac72bb9559bad827d9f6a354 by Mamatha Busi:
Separate cookieStorage by application

edit: TestFoundation/TestNSHTTPCookieStorage.swift
edit: TestFoundation/XDGTestHelper.swift
edit: Foundation/NSHTTPCookieStorage.swift