[Swift CI] Build Failure: OSS - Swift Package - Ubuntu 14.04 (master) #3000


(Swift CI) #1

Report

[FAILURE] oss-swift-package-linux-ubuntu-14_04 [#3000]

Build URL:
https://ci.swift.org/job/oss-swift-package-linux-ubuntu-14_04/3000/
Project:
oss-swift-package-linux-ubuntu-14_04
Date of build:
Thu, 07 Feb 2019 16:42:17 -0600
Build duration:
2 hr 48 min

Changes

  • Commit 3656084c1148d99be29f3bd50c8fbfd7e71011fa by blangmuir:
    [build-script] Add install-destdir and set a default value

    • edit: utils/build_swift/driver_arguments.py
    • edit: utils/build_swift/tests/expected_options.py
    • edit: utils/build-script
  • Commit 6cc14afec9c70fbed842b2f9d7edf4f585e38e88 by blangmuir:
    [build-script] build and test indexstore-db and sourcekit-lsp

    • add: utils/swift_build_support/swift_build_support/products/indexstoredb.py
    • edit: utils/build_swift/tests/expected_options.py
    • edit: utils/swift_build_support/swift_build_support/products/ninja.py
    • edit: utils/swift_build_support/swift_build_support/products/product.py
    • edit: utils/swift_build_support/swift_build_support/products/init.py
    • edit: utils/build-script
    • edit: utils/build_swift/driver_arguments.py
    • add: utils/swift_build_support/swift_build_support/products/sourcekitlsp.py
  • Commit c64d74777c9191ac7ce8e5f21d867a33919db3ce by blangmuir:
    Add packages to presets

    • edit: utils/build-presets.ini
  • Commit c034445bd23146b4792917f487f30412d82a887a by blangmuir:
    [build-script] Fix test_driver_arguments failures

    • edit: utils/build_swift/driver_arguments.py
    • edit: utils/build_swift/tests/expected_options.py
  • Commit 9bbd28725a17d3adc74f8487b0f68839b4c5461f by blangmuir:
    [build-script] Fix pylint warnings from indexstoredb/sourcekitlsp

    • edit: utils/swift_build_support/swift_build_support/products/indexstoredb.py
    • edit: utils/swift_build_support/swift_build_support/products/sourcekitlsp.py
    • edit: utils/build-script
  • Commit 953cb4cb0581405b52d199a92c5c91983a614d08 by blangmuir:
    Fixup rebase conflicts

    • edit: utils/build-script
  • Commit 6928ca630e3e8ca44b2b7d759505e53281411411 by compnerd:
    ABI: use nullptr instead of 0 for NULL comparision

    • edit: include/swift/ABI/Metadata.h
  • Commit 4a2f7c9192b18f0125fd60fbddea6f996a259bd6 by compnerd:
    test: correct paths in DebugInfo/line-directive (NFC)

    • edit: test/DebugInfo/line-directive.swift
  • Commit 6fa90007902d95aa22d88539aa2ce7ed054c5b39 by compnerd:
    Frontend: compare normalised absolute paths for temp

    • edit: test/DebugInfo/compiler-flags.swift
    • edit: lib/Frontend/CompilerInvocation.cpp
  • Commit 3d5062222364288804f73b9d8991b4e45de4f1a1 by rjmccall:
    Fix a bug with demangling reference storage that I just introduced.

    • edit: stdlib/public/runtime/Private.h
  • Commit 7c88b22e897112d0a630be67a6c310c3d8ed9fb0 by rjmccall:
    Remove some comments that are both unnecessary and invalid.

    • edit: include/swift/Runtime/RuntimeFunctions.def
  • Commit 79d15816c41eaab5a587254c6bdfed19464f0542 by rjmccall:
    Fix a race condition with the initialization of class metadata.

    • edit: lib/IRGen/GenMeta.cpp
    • edit: test/IRGen/generic_classes.sil
    • edit: test/IRGen/generic_vtable.swift
    • edit: lib/IRGen/MetadataRequest.cpp
    • edit: lib/IRGen/MetadataRequest.h
    • edit: test/IRGen/class_resilience.swift
    • edit: test/IRGen/completely_fragile_class_layout.sil
    • edit: test/IRGen/mixed_mode_class_with_unimportable_fields.swift
    • edit: test/IRGen/type_layout_reference_storage.swift
    • edit: stdlib/public/runtime/ProtocolConformance.cpp
    • edit: test/IRGen/concrete_inherits_generic_base.swift
  • Commit a97c732d759268678a5d24d818f1e4764ca28edb by github:
    Update WindowsBuild.md

    • edit: docs/WindowsBuild.md
  • Commit d08b46c47e8c3086523c6d5873b209e26237197e by danielrodriguez:
    [tests] Standarize the checks for Darwin, Glibc and MSVCRT.

    • edit: test/ClangImporter/availability_returns_twice.swift
    • edit: test/Fuzzing/fuzzer_test_simpler.swift
    • edit: validation-test/StdlibUnittest/Stdin.swift
    • edit: test/Fuzzing/fuzzer_test.swift
    • edit: test/stdlib/tgmath.swift.gyb
    • edit: test/Sanitizers/tsan.swift
    • edit: test/Interpreter/dynamic_replacement_chaining.swift
    • edit: test/stdlib/PrintFloat.swift.gyb
    • edit: test/stdlib/VarArgs.swift
    • edit: validation-test/StdlibUnittest/RaceTest.swift
    • edit: test/IRGen/sanitize_coverage.swift
    • edit: validation-test/StdlibUnittest/ChildProcessShutdown/FailIfChildExitsDuringShutdown.swift
    • edit: test/Interpreter/dynamic_replacement.swift
    • edit: test/stdlib/tgmath_optimized.swift
    • edit: test/stdlib/FloatConstants.swift
    • edit: test/ClangImporter/clang_builtins.swift
    • edit: test/stdlib/MathConstants.swift
    • edit: test/stdlib/POSIX.swift
    • edit: test/IRGen/builtin_math.swift
    • edit: test/Prototypes/BigInt.swift
    • edit: validation-test/StdlibUnittest/AtomicInt.swift
    • edit: test/Interpreter/SDK/libc.swift
    • edit: test/stdlib/mmap.swift
    • edit: validation-test/stdlib/String.swift
    • edit: test/Interpreter/dynamic_replacement_dlclose.swift
    • edit: validation-test/StdlibUnittest/ChildProcessShutdown/FailIfChildCrashesDuringShutdown.swift
    • edit: test/stdlib/Runtime.swift.gyb
    • edit: validation-test/stdlib/POSIXErrorCode.swift
    • edit: validation-test/StdlibUnittest/ChildProcessShutdown/PassIfChildCrashedDuringTestExecution.swift
    • edit: validation-test/stdlib/StringSlicesConcurrentAppend.swift
  • Commit 877a20ead02c3f6073998dbab58e65d6cbe0f0e0 by milseman:
    [String] Fix crash when given null UBP

    • edit: stdlib/public/core/StringCreate.swift
    • edit: stdlib/public/core/String.swift
    • edit: stdlib/public/core/ContiguouslyStored.swift
    • edit: stdlib/public/core/SmallString.swift
    • add: test/stdlib/StringCreate.swift
  • Commit c8acb7e4c23648f4de69cef9bfa2f3a864d965a4 by github:
    @objc extension makes even 'private' members '@objc' (#22436)

    • edit: lib/Sema/TypeCheckDeclObjC.cpp
    • edit: test/attr/attr_objc.swift
  • Commit d364bb359bf2529ae050335c1f3549c0f6b3e628 by mgottesman:
    [silgenpattern] Fix the box handling in the old silgenpattern enum code

    • edit: lib/SILGen/SILGenPattern.cpp
    • edit: test/SILGen/indirect_enum.swift
    • add: test/Interpreter/indirect_enum.swift
  • Commit 515bac9773119bbe1a3bd4c2f3b39b44e39d9a9d by nathan:
    Un-comment-out a few things that were removed due to swift using old

    • edit: source/Symbol/ClangASTContext.cpp
    • edit: include/lldb/Symbol/ClangASTContext.h
  • Commit 3075abaf73a5666bd3011b17f2a7de03b8990320 by ditaliano:
    [SwiftASTContext] Clean up function types and document a limitation.

    • edit: source/Symbol/SwiftASTContext.cpp
  • Commit 43659045970c50c77a40340dd7aba0b67749bfcd by blangmuir:
    Fix build on Ubuntu 14.04

    • edit: Package.swift
    • edit: include/indexstore/IndexStoreCXX.h
    • edit: lib/Support/Logging.cpp

(Michael Ilseman) #2

Ben, build configuration error?

**19:30:11** In file included from //usr/lib/gcc/x86_64-linux-gnu/4.8/../../../../include/c++/4.8/algorithm:62:
**19:30:11** In file included from //usr/lib/gcc/x86_64-linux-gnu/4.8/../../../../include/c++/4.8/bits/stl_algo.h:65:
**19:30:11** In file included from //usr/lib/gcc/x86_64-linux-gnu/4.8/../../../../include/c++/4.8/random:39:
**19:30:11** //usr/lib/gcc/x86_64-linux-gnu/4.8/../../../../include/c++/4.8/cstdio:120:11: error: no member named 'gets' in the global namespace
**19:30:11**   using ::gets;
**19:30:11**         ~~^
**19:30:12** 1 error generated.
**19:30:14** /home/buildnode/jenkins/workspace/oss-swift-package-linux-ubuntu-14_04/swift-nightly-install/usr/bin/swift build --package-path /home/buildnode/jenkins/workspace/oss-swift-package-linux-ubuntu-14_04/sourcekit-lsp --build-path /home/buildnode/jenkins/workspace/oss-swift-package-linux-ubuntu-14_04/build/buildbot_linux/sourcekitlsp-linux-x86_64 --configuration release --verbose -Xswiftc -enable-testing -Xcxx -I -Xcxx /home/buildnode/jenkins/workspace/oss-swift-package-linux-ubuntu-14_04/swift-nightly-install/usr/lib/swift
**19:30:14** Traceback (most recent call last):

(Ben Langmuir) #3

Should be fixed in the next build (by disabling this project on 14.04).