[Swift CI] Build Failure: OSS - Swift Package - Ubuntu 14.04 (master) #2188


(Michael Ilseman) #1

LLDB failures

[TestDataFormatterLibccIterator.py FAILED]
Command invoked: /usr/bin/python /home/buildnode/disk2/workspace/oss-swift-package-linux-ubuntu-14_04/lldb/test/dotest.py --executable /home/buildnode/disk2/workspace/oss-swift-package-linux-ubuntu-14_04/build/buildbot_linux/lldb-linux-x86_64/bin/lldb --rerun-all-issues -C /home/buildnode/disk2/workspace/oss-swift-package-linux-ubuntu-14_04/build/buildbot_linux/llvm-linux-x86_64/bin/clang -s 2016-09-30-04_54_52 --results-port 60602 -S fnmac --inferior -p TestDataFormatterLibccIterator.py /home/buildnode/disk2/workspace/oss-swift-package-linux-ubuntu-14_04/lldb/packages/Python/lldbsuite/test --event-add-entries worker_index=9:int

···

On Sep 29, 2016, at 9:59 PM, no-reply@swift.org wrote:

[FAILURE] oss-swift-package-linux-ubuntu-14_04 [#2188]

Build URL: https://ci.swift.org/job/oss-swift-package-linux-ubuntu-14_04/2188/
Project: oss-swift-package-linux-ubuntu-14_04
Date of build: Thu, 29 Sep 2016 20:48:16 -0700
Build duration: 1 hr 11 min
Identified problems:

Regression test failed: This build failed because a regression test in the test suite FAILed. Below is a list of all errors:
Indication 1 <https://ci.swift.org//job/oss-swift-package-linux-ubuntu-14_04/2188/consoleFull#-37597929fca400bf-2f4a-462e-b517-e058d770b2d7>
Changes

Commit 341d022ba708a2e9043de3a78826edbf3bea9c9b by modocache:
[runtime] Update CMake to use TARGET_SDKS (NFC)

edit: stdlib/public/runtime/CMakeLists.txt

Commit e092774a08ab4edb95c6ef382ae9decaf295795b by milseman:
[Import Name] Ruin SwiftNameLookupExtension and Impl's friendship

edit: lib/ClangImporter/ImportDecl.cpp
edit: lib/ClangImporter/ClangImporter.cpp
edit: lib/ClangImporter/ImporterImpl.h
edit: lib/ClangImporter/ImportName.cpp
edit: lib/ClangImporter/ImportMacro.cpp
edit: include/swift/ClangImporter/ClangImporter.h
edit: lib/ClangImporter/ImportName.h

Commit bf6baead4e3edaef6f0805e1ed4c2e37fdc33458 by rlevenstein:
[irgen] Fix linkage of global aliases in case of using the wholemodule

edit: lib/IRGen/IRGen.cpp
add: test/IRGen/Inputs/main.swift
add: test/IRGen/extension_type_metadata_linking.swift

Commit 7a1a6af8361dba68ea4bbb7fe99a581f83a78ca5 by milseman:
[Clang Importer] Restore shouldIgnoreMacro API

edit: include/swift/ClangImporter/ClangImporter.h
edit: lib/ClangImporter/ImportName.cpp

Commit e6f263fe312f78b6cf88eb542e8daebb2ff08c40 by github:
[SyntaxColor] Respect keywords' syntax kind when they appear in

edit: lib/IDE/SyntaxModel.cpp
edit: test/IDE/coloring.swift

Commit 3e84c1e4cb4bce24861c87ca8bc76d8ec6a3c6c5 by beanz:
[CMake] NFC. Cleanup repl_swift targets

edit: tools/repl/swift/CMakeLists.txt

Commit 5908628c715704cfa47ee572d8d9b8bf39012df2 by beanz:
[CMake] Add missing swift-stdlib dependency for repl_swift

edit: tools/repl/swift/CMakeLists.txt


(Todd Fiala) #2

This is another case of:

This is:
https://llvm.org/bugs/show_bug.cgi?id=27423 <https://llvm.org/bugs/show_bug.cgi?id=27423>

(a.k.a. <rdar://problem/25528549> test infra: clear file-level-charged issues when a file is rerun)

I’ll be increasing the priority of fixing that.

Given that this has hit two of our CI builds in the last couple days, I am going to make this my highest priority.

···

On Sep 30, 2016, at 10:20 AM, Michael Ilseman via swift-lldb-dev <swift-lldb-dev@swift.org> wrote:

LLDB failures

[TestDataFormatterLibccIterator.py FAILED]
Command invoked: /usr/bin/python /home/buildnode/disk2/workspace/oss-swift-package-linux-ubuntu-14_04/lldb/test/dotest.py --executable /home/buildnode/disk2/workspace/oss-swift-package-linux-ubuntu-14_04/build/buildbot_linux/lldb-linux-x86_64/bin/lldb --rerun-all-issues -C /home/buildnode/disk2/workspace/oss-swift-package-linux-ubuntu-14_04/build/buildbot_linux/llvm-linux-x86_64/bin/clang -s 2016-09-30-04_54_52 --results-port 60602 -S fnmac --inferior -p TestDataFormatterLibccIterator.py /home/buildnode/disk2/workspace/oss-swift-package-linux-ubuntu-14_04/lldb/packages/Python/lldbsuite/test --event-add-entries worker_index=9:int

On Sep 29, 2016, at 9:59 PM, no-reply@swift.org <mailto:no-reply@swift.org> wrote:

[FAILURE] oss-swift-package-linux-ubuntu-14_04 [#2188]

Build URL: https://ci.swift.org/job/oss-swift-package-linux-ubuntu-14_04/2188/
Project: oss-swift-package-linux-ubuntu-14_04
Date of build: Thu, 29 Sep 2016 20:48:16 -0700
Build duration: 1 hr 11 min
Identified problems:

Regression test failed: This build failed because a regression test in the test suite FAILed. Below is a list of all errors:
Indication 1 <https://ci.swift.org//job/oss-swift-package-linux-ubuntu-14_04/2188/consoleFull#-37597929fca400bf-2f4a-462e-b517-e058d770b2d7>
Changes

Commit 341d022ba708a2e9043de3a78826edbf3bea9c9b by modocache:
[runtime] Update CMake to use TARGET_SDKS (NFC)

edit: stdlib/public/runtime/CMakeLists.txt

Commit e092774a08ab4edb95c6ef382ae9decaf295795b by milseman:
[Import Name] Ruin SwiftNameLookupExtension and Impl's friendship

edit: lib/ClangImporter/ImportDecl.cpp
edit: lib/ClangImporter/ClangImporter.cpp
edit: lib/ClangImporter/ImporterImpl.h
edit: lib/ClangImporter/ImportName.cpp
edit: lib/ClangImporter/ImportMacro.cpp
edit: include/swift/ClangImporter/ClangImporter.h
edit: lib/ClangImporter/ImportName.h

Commit bf6baead4e3edaef6f0805e1ed4c2e37fdc33458 by rlevenstein:
[irgen] Fix linkage of global aliases in case of using the wholemodule

edit: lib/IRGen/IRGen.cpp
add: test/IRGen/Inputs/main.swift
add: test/IRGen/extension_type_metadata_linking.swift

Commit 7a1a6af8361dba68ea4bbb7fe99a581f83a78ca5 by milseman:
[Clang Importer] Restore shouldIgnoreMacro API

edit: include/swift/ClangImporter/ClangImporter.h
edit: lib/ClangImporter/ImportName.cpp

Commit e6f263fe312f78b6cf88eb542e8daebb2ff08c40 by github:
[SyntaxColor] Respect keywords' syntax kind when they appear in

edit: lib/IDE/SyntaxModel.cpp
edit: test/IDE/coloring.swift

Commit 3e84c1e4cb4bce24861c87ca8bc76d8ec6a3c6c5 by beanz:
[CMake] NFC. Cleanup repl_swift targets

edit: tools/repl/swift/CMakeLists.txt

Commit 5908628c715704cfa47ee572d8d9b8bf39012df2 by beanz:
[CMake] Add missing swift-stdlib dependency for repl_swift

edit: tools/repl/swift/CMakeLists.txt

_______________________________________________
swift-lldb-dev mailing list
swift-lldb-dev@swift.org
https://lists.swift.org/mailman/listinfo/swift-lldb-dev


(Todd Fiala) #3

This is another case of:

This is:
https://llvm.org/bugs/show_bug.cgi?id=27423 <https://llvm.org/bugs/show_bug.cgi?id=27423>

(a.k.a. <rdar://problem/25528549 <rdar://problem/25528549>> test infra: clear file-level-charged issues when a file is rerun)

I’ll be increasing the priority of fixing that.

Given that this has hit two of our CI builds in the last couple days, I am going to make this my highest priority.

I’ve got a fix for this in LLVM.org <http://llvm.org/> lldb r282990. I’ll be pulling this into github with an upstream merge by early next week, if not sooner.

···

On Sep 30, 2016, at 11:02 AM, Todd Fiala <tfiala@apple.com> wrote:

On Sep 30, 2016, at 10:20 AM, Michael Ilseman via swift-lldb-dev <swift-lldb-dev@swift.org <mailto:swift-lldb-dev@swift.org>> wrote:

LLDB failures

[TestDataFormatterLibccIterator.py FAILED]
Command invoked: /usr/bin/python /home/buildnode/disk2/workspace/oss-swift-package-linux-ubuntu-14_04/lldb/test/dotest.py --executable /home/buildnode/disk2/workspace/oss-swift-package-linux-ubuntu-14_04/build/buildbot_linux/lldb-linux-x86_64/bin/lldb --rerun-all-issues -C /home/buildnode/disk2/workspace/oss-swift-package-linux-ubuntu-14_04/build/buildbot_linux/llvm-linux-x86_64/bin/clang -s 2016-09-30-04_54_52 --results-port 60602 -S fnmac --inferior -p TestDataFormatterLibccIterator.py /home/buildnode/disk2/workspace/oss-swift-package-linux-ubuntu-14_04/lldb/packages/Python/lldbsuite/test --event-add-entries worker_index=9:int

On Sep 29, 2016, at 9:59 PM, no-reply@swift.org <mailto:no-reply@swift.org> wrote:

[FAILURE] oss-swift-package-linux-ubuntu-14_04 [#2188]

Build URL: https://ci.swift.org/job/oss-swift-package-linux-ubuntu-14_04/2188/
Project: oss-swift-package-linux-ubuntu-14_04
Date of build: Thu, 29 Sep 2016 20:48:16 -0700
Build duration: 1 hr 11 min
Identified problems:

Regression test failed: This build failed because a regression test in the test suite FAILed. Below is a list of all errors:
Indication 1 <https://ci.swift.org//job/oss-swift-package-linux-ubuntu-14_04/2188/consoleFull#-37597929fca400bf-2f4a-462e-b517-e058d770b2d7>
Changes

Commit 341d022ba708a2e9043de3a78826edbf3bea9c9b by modocache:
[runtime] Update CMake to use TARGET_SDKS (NFC)

edit: stdlib/public/runtime/CMakeLists.txt

Commit e092774a08ab4edb95c6ef382ae9decaf295795b by milseman:
[Import Name] Ruin SwiftNameLookupExtension and Impl's friendship

edit: lib/ClangImporter/ImportDecl.cpp
edit: lib/ClangImporter/ClangImporter.cpp
edit: lib/ClangImporter/ImporterImpl.h
edit: lib/ClangImporter/ImportName.cpp
edit: lib/ClangImporter/ImportMacro.cpp
edit: include/swift/ClangImporter/ClangImporter.h
edit: lib/ClangImporter/ImportName.h

Commit bf6baead4e3edaef6f0805e1ed4c2e37fdc33458 by rlevenstein:
[irgen] Fix linkage of global aliases in case of using the wholemodule

edit: lib/IRGen/IRGen.cpp
add: test/IRGen/Inputs/main.swift
add: test/IRGen/extension_type_metadata_linking.swift

Commit 7a1a6af8361dba68ea4bbb7fe99a581f83a78ca5 by milseman:
[Clang Importer] Restore shouldIgnoreMacro API

edit: include/swift/ClangImporter/ClangImporter.h
edit: lib/ClangImporter/ImportName.cpp

Commit e6f263fe312f78b6cf88eb542e8daebb2ff08c40 by github:
[SyntaxColor] Respect keywords' syntax kind when they appear in

edit: lib/IDE/SyntaxModel.cpp
edit: test/IDE/coloring.swift

Commit 3e84c1e4cb4bce24861c87ca8bc76d8ec6a3c6c5 by beanz:
[CMake] NFC. Cleanup repl_swift targets

edit: tools/repl/swift/CMakeLists.txt

Commit 5908628c715704cfa47ee572d8d9b8bf39012df2 by beanz:
[CMake] Add missing swift-stdlib dependency for repl_swift

edit: tools/repl/swift/CMakeLists.txt

_______________________________________________
swift-lldb-dev mailing list
swift-lldb-dev@swift.org <mailto:swift-lldb-dev@swift.org>
https://lists.swift.org/mailman/listinfo/swift-lldb-dev