[Swift CI] Build Failure: OSS - Swift Package - Ubuntu 14.04 (master) #1804


(Anders Bertelrud) #1

I am investigating why 6f0b1047d51e6260967ad06e9ded1fa905d508f4 doesn't seem to have fixed this.

Anders

···

On Jul 28, 2016, at 18:30, no-reply@swift.org wrote:

[FAILURE] oss-swift-package-linux-ubuntu-14_04 [#1804]

Build URL: https://ci.swift.org/job/oss-swift-package-linux-ubuntu-14_04/1804/
Project: oss-swift-package-linux-ubuntu-14_04
Date of build: Thu, 28 Jul 2016 17:36:21 -0700
Build duration: 54 min
Identified problems:

Regression test failed: This build failed because a regression test in the test suite FAILed. Below is a list of all errors:
Indication 1
Indication 2

Changes

Commit 3a792f7382a5e8cde26364f3209ec6587f84908f by jordan_rose:
One more 'fileprivate' in newly-added Foundation code.

edit: stdlib/public/SDK/Foundation/IndexPath.swift

Commit 6dea23a02974f73fea98038350eeaa6b1959c13e by jordan_rose:
Flip the switch on 'private' and 'fileprivate' (SE-0025).

edit: validation-test/compiler_crashers_2_fixed/0016-rdar21437203.swift
edit: lib/AST/Decl.cpp
edit: lib/AST/NameLookup.cpp
edit: lib/Sema/TypeCheckDecl.cpp
add: test/Sema/accessibility_private.swift

Commit 2a5b9d65597af5feeb07247967c90e79df7ee50a by jgroff:
Remove now-dead _isBridgedToObjectiveC() declarations in

edit: stdlib/public/core/ImplicitlyUnwrappedOptional.swift
edit: test/SILOptimizer/sil_combine_objc_bridge.sil
edit: test/SILOptimizer/bridging_checked_cast.sil
edit: test/1_stdlib/RuntimeObjC.swift
edit: test/IRGen/Inputs/Foundation.swift
edit: test/1_stdlib/SetTrapsObjC.swift
edit: test/SILGen/collection_upcast.swift
edit: test/1_stdlib/Bridgeable.swift
edit: test/1_stdlib/Inputs/DictionaryKeyValueTypesObjC.swift
edit: test/1_stdlib/DictionaryTrapsObjC.swift
edit: test/Inputs/ObjCBridging/Appliances.swift
edit: test/1_stdlib/DebuggerSupport.swift
edit: stdlib/public/core/BridgeObjectiveC.swift
edit: test/expr/cast/dictionary_bridge.swift
edit: test/Inputs/clang-importer-sdk/swift-modules/Foundation.swift
edit: test/expr/cast/array_downcast.swift
edit: test/Constraints/bridging.swift
edit: test/expr/cast/bridged.swift
edit: test/expr/cast/set_bridge.swift
edit: test/Inputs/clang-importer-sdk/swift-modules-without-ns/Foundation.swift
edit: test/expr/cast/array_bridge.swift
edit: test/1_stdlib/BridgeNonVerbatim.swift
edit: test/SILOptimizer/cast_folding_objc.swift
edit: test/SILGen/collection_downcast.swift
edit: test/SILGen/Inputs/Foundation.swift
edit: test/1_stdlib/ArrayBridge.swift.gyb

Commit d206bb5aa1de732f77cfb470d1c350fdf801b423 by jgroff:
Runtime: Let structural types be cast out of boxed AnyObjects too.

edit: stdlib/public/runtime/Casting.cpp
edit: test/1_stdlib/BridgeIdAsAny.swift.gyb

Commit ef99d39d3b833f890b6df5f3c2ddfe547d0962cb by anthony.parker:
Adapt to UnsafeRawPointer changes in Data initializer and deallocator

edit: stdlib/public/SDK/Foundation/Data.swift

Commit 3dd898f7f08d0cd6a29653e8c78dd92425a02083 by dgregor:
[Constraint application] Don't recompute the type of the a member

edit: lib/Sema/CSApply.cpp

Commit 8c7e75afa044f71bd5b5b5f12284bddd0d907b27 by dgregor:
[AST] Eliminate OverloadedMemberRefExpr.

edit: lib/AST/ASTDumper.cpp
edit: lib/Sema/CSApply.cpp
edit: lib/Sema/CSGen.cpp
edit: lib/AST/ASTWalker.cpp
edit: include/swift/AST/ExprNodes.def
edit: lib/Sema/CSDiag.cpp
edit: lib/AST/Expr.cpp
edit: include/swift/AST/Expr.h

Commit 6f0b1047d51e6260967ad06e9ded1fa905d508f4 by anders:
Updating for SE-0129 Package Manager Test Naming Conventions

edit: swift-package-init-lib.md

Commit fb5f684cc465e342d1876d0506032ae77880431d by anders:
Implement SE-0129 to update the test naming conventions. Instead of

add: Tests/BasicTests/FileSystemTests.swift
delete: Tests/Get/VersionGraphTests.swift
add: Tests/UtilityTests/StringTests.swift
add: Tests/PackageDescriptionTests/VersionTests.swift
delete: Tests/Basic/ByteStringPerfTests.swift
delete: Tests/PackageDescription/PackageTests.swift
delete: Tests/PackageLoading/Inputs/trivial-manifest
delete: Tests/Basic/TOMLTests.swift
delete: Tests/Basic/POSIXTests.swift
add: Tests/UtilityTests/GitTests.swift
delete: Tests/Utility/pkgconfigInputs/gtk+-3.0.pc
add: Tests/CommandsTests/XCTestManifests.swift
add: Tests/PackageDescriptionTests/XCTestManifests.swift
add: Tests/FunctionalTests/MiscellaneousTests.swift
delete: Tests/Functional/ModuleMapTests.swift
delete: Tests/Utility/CollectionTests.swift
add: Tests/GetTests/VersionGraphTests.swift
delete: Tests/PackageDescription/XCTestManifests.swift
add: Tests/UtilityTests/pkgconfigInputs/failure_case.pc
add: Tests/PackageLoadingTests/Inputs/trivial-manifest
delete: Tests/Functional/SwiftPMXCTestHelperTests.swift
delete: Tests/PackageLoading/WhitelistTests.swift
delete: Tests/Commands/TestToolTests.swift
add: Tests/CommandsTests/Utilities.swift
edit: Sources/Commands/init.swift
add: Tests/BuildTests/Utilities.swift
delete: Tests/Build/Utilities.swift
add: Tests/FunctionalTests/XCTestManifests.swift
delete: Tests/Functional/ClangModuleTests.swift
add: Tests/BasicTests/Inputs/regular_text_file
delete: Tests/Basic/LazyCacheTests.swift
delete: Tests/Get/XCTestManifests.swift
delete: Tests/Basic/CollectionAlgorithmsTests.swift
delete: Tests/POSIX/ReaddirTests.swift
delete: Tests/Utility/pkgconfigInputs/failure_case.pc
add: Tests/BasicTests/PathPerfTests.swift
add: Tests/UtilityTests/XCTestManifests.swift
delete: Tests/Basic/XCTestManifests.swift
add: Tests/CommandsTests/BuildToolTests.swift
add: Tests/GetTests/XCTestManifests.swift
delete: Tests/Xcodeproj/FunctionalTests.swift
delete: Tests/PackageLoading/SerializationTests.swift
delete: Tests/Basic/OutputByteStreamPerfTests.swift
delete: Tests/Get/GitTests.swift
add: Tests/BasicTests/Inputs/empty_file
add: Tests/GetTests/GitTests.swift
add: Tests/BasicTests/StringConversionsTests.swift
add: Tests/FunctionalTests/Utilities.swift
delete: Tests/Basic/OrderedSetTests.swift
add: Tests/PackageLoadingTests/ConventionTests.swift
add: Tests/PackageGraphTests/PackageGraphTests.swift
delete: Tests/Basic/StringConversionsTests.swift
delete: Tests/Basic/OptionParserTests.swift
add: Tests/PackageLoadingTests/SerializationTests.swift
add: Tests/FunctionalTests/ValidLayoutTests.swift
add: Tests/UtilityTests/PkgConfigParserTests.swift
delete: Tests/SourceControl/GitRepositoryTests.swift
delete: Tests/Utility/PkgConfigParserTests.swift
add: Tests/PackageDescriptionTests/PackageTests.swift
add: Tests/PackageLoadingTests/Inputs/package-deps-manifest
delete: Tests/PackageLoading/ManifestTests.swift
add: Tests/BuildTests/DescribeTests.swift
add: Tests/PackageLoadingTests/JSONSerializationTests.swift
delete: Tests/Utility/StringTests.swift
add: Fixtures/Miscellaneous/Spaces Fixture/Tests/Moudule Tests/Foo.swift
add: Tests/PackageModelTests/ModuleTests.swift
delete: Fixtures/Miscellaneous/SwiftPMXCTestHelper/Tests/SwiftPMXCTestHelper/SwiftPMXCTestHelperTests.swift
edit: Sources/PackageLoading/PackageBuilder.swift
add: Tests/BasicTests/POSIXTests.swift
add: Tests/BuildTests/PackageVersionDataTests.swift
delete: Tests/Xcodeproj/Utilities.swift
add: Tests/XcodeprojTests/FunctionalTests.swift
delete: Tests/Utility/pkgconfigInputs/deps_variable.pc
delete: Tests/PackageLoading/Inputs/target-deps-manifest
delete: Tests/Basic/TemporaryFileTests.swift
delete: Tests/PackageModel/c99nameTests.swift
delete: Tests/Basic/Inputs/empty_file
add: Tests/BasicTests/OutputByteStreamPerfTests.swift
delete: Tests/Get/Utilities.swift
delete: Tests/SourceControl/XCTestManifests.swift
add: Tests/BasicTests/GraphAlgorithmsTests.swift
add: Tests/PackageLoadingTests/Utilities.swift
add: Tests/FunctionalTests/ClangModuleTests.swift
delete: Tests/PackageLoading/JSONSerializationTests.swift
edit: Fixtures/Miscellaneous/PackageWithInvalidTargets/Tests/LinuxMain.swift
add: Tests/SourceControlTests/XCTestManifests.swift
add: Tests/UtilityTests/CollectionTests.swift
add: Tests/GetTests/GetTests.swift
add: Tests/UtilityTests/pkgconfigInputs/empty_cflags.pc
delete: Tests/Utility/XCTestManifests.swift
delete: Fixtures/Miscellaneous/Spaces Fixture/Tests/Test Module Name/Foo.swift
add: Tests/UtilityTests/Utilities.swift
add: Tests/UtilityTests/pkgconfigInputs/escaped_spaces.pc
delete: Tests/Commands/XCTestManifests.swift
delete: Tests/Basic/OutputByteStreamTests.swift
add: Tests/BasicTests/ThreadTests.swift
delete: Tests/Basic/ByteStringTests.swift
delete: Tests/Basic/FileSystemTests.swift
delete: Tests/PackageLoading/ConventionTests.swift
delete: Tests/SourceControl/CheckoutManagerTests.swift
add: Fixtures/Miscellaneous/SwiftPMXCTestHelper/Tests/SwiftPMXCTestHelperTests/SwiftPMXCTestHelperTests.swift
delete: Tests/Get/GetTests.swift
delete: Tests/Build/DescribeTests.swift
delete: Tests/Build/XCTestManifests.swift
delete: Tests/Commands/BuildToolTests.swift
delete: Tests/Basic/PathTests.swift
delete: Tests/Functional/XCTestManifests.swift
add: Tests/BuildTests/XCTestManifests.swift
add: Tests/FunctionalTests/DependencyResolutionTests.swift
add: Tests/PackageGraphTests/PackageGraph/DependencyResolverTests.swift
add: Tests/BasicTests/OutputByteStreamTests.swift
add: Tests/PackageModelTests/c99nameTests.swift
add: Tests/FunctionalTests/ModuleMapTests.swift
delete: Tests/PackageLoading/ModuleDependencyTests.swift
add: Tests/BasicTests/ByteStringTests.swift
add: Tests/BasicTests/XCTestManifests.swift
delete: Tests/PackageLoading/XCTestManifests.swift
add: Tests/BasicTests/OptionParserTests.swift
add: Tests/PackageLoadingTests/WhitelistTests.swift
delete: Tests/PackageModel/ModuleTests.swift
add: Tests/PackageModelTests/XCTestManifests.swift
delete: Tests/Build/PackageVersionDataTests.swift
delete: Tests/Functional/ValidLayoutTests.swift
delete: Tests/PackageLoading/Inputs/package-deps-manifest
delete: Tests/Basic/SynchronizedQueueTests.swift
delete: Tests/Basic/GraphAlgorithmsTests.swift
delete: Tests/Commands/PackageToolTests.swift
add: Tests/BasicTests/PathTests.swift
add: Tests/BasicTests/SynchronizedQueueTests.swift
delete: Tests/PackageGraph/XCTestManifests.swift
delete: Tests/Basic/Inputs/regular_text_file
add: Tests/UtilityTests/ShellTests.swift
edit: Sources/PackageModel/Module.swift
add: Tests/XcodeprojTests/XCTestManifests.swift
add: Tests/BasicTests/StringConversionsPerfTests.swift
add: Tests/FunctionalTests/InvalidLayoutTests.swift
add: Tests/PackageGraphTests/XCTestManifests.swift
add: Fixtures/Miscellaneous/SwiftPMXCTestHelper/Tests/ObjCTests/ObjCTests.m
add: Tests/PackageLoadingTests/XCTestManifests.swift
add: Tests/BasicTests/PathShimTests.swift
add: Tests/SourceControlTests/GitRepositoryTests.swift
add: Tests/PackageLoadingTests/Inputs/target-deps-manifest
add: Tests/SourceControlTests/CheckoutManagerTests.swift
add: Tests/FunctionalTests/SwiftPMXCTestHelperTests.swift
delete: Tests/Functional/DependencyResolutionTests.swift
add: Tests/BasicTests/CollectionAlgorithmsTests.swift
add: Tests/BasicTests/TemporaryFileTests.swift
delete: Tests/Basic/PathShimTests.swift
add: Tests/BasicTests/LazyCacheTests.swift
delete: Tests/Commands/Utilities.swift
delete: Tests/Functional/Utilities.swift
add: Tests/BasicTests/TOMLTests.swift
delete: Tests/SourceControl/Inputs/TestRepo.tgz
delete: Tests/Utility/Utilities.swift
delete: Tests/Utility/ShellTests.swift
add: Tests/UtilityTests/pkgconfigInputs/deps_variable.pc
add: Tests/GetTests/Utilities.swift
add: Tests/BasicTests/OrderedSetTests.swift
delete: Tests/Basic/PathPerfTests.swift
delete: Tests/PackageModel/XCTestManifests.swift
add: Tests/XcodeprojTests/GenerateXcodeprojTests.swift
add: Tests/BasicTests/ByteStringPerfTests.swift
delete: Tests/Basic/StringConversionsPerfTests.swift
add: Tests/SourceControlTests/Inputs/TestRepo.tgz
add: Tests/POSIXTests/XCTestManifests.swift
add: Tests/BasicTests/LockTests.swift
add: Tests/PackageLoadingTests/ManifestTests.swift
delete: Tests/Functional/MiscellaneousTests.swift
delete: Tests/PackageGraph/DependencyResolverTests.swift
add: Tests/CommandsTests/PackageToolTests.swift
delete: Tests/Utility/GitTests.swift
add: Tests/XcodeprojTests/Utilities.swift
delete: Tests/PackageDescription/VersionTests.swift
delete: Tests/Basic/ThreadTests.swift
delete: Tests/Basic/JSONTests.swift
add: Tests/CommandsTests/TestToolTests.swift
delete: Tests/Utility/pkgconfigInputs/escaped_spaces.pc
delete: Tests/PackageLoading/Utilities.swift
delete: Tests/Xcodeproj/GenerateXcodeprojTests.swift
delete: Tests/Basic/LockTests.swift
add: Tests/POSIXTests/ReaddirTests.swift
delete: Tests/SourceControl/Utilities.swift
add: Tests/BasicTests/JSONTests.swift
delete: Tests/POSIX/XCTestManifests.swift
add: Tests/PackageLoadingTests/ModuleDependencyTests.swift
add: Tests/SourceControlTests/Utilities.swift
delete: Tests/Utility/pkgconfigInputs/empty_cflags.pc
add: Tests/UtilityTests/pkgconfigInputs/gtk+-3.0.pc
delete: Fixtures/Miscellaneous/SwiftPMXCTestHelper/Tests/ObjcTest/Objc.m
delete: Tests/Xcodeproj/XCTestManifests.swift
delete: Tests/PackageGraph/PackageGraphTests.swift
edit: Tests/LinuxMain.swift

Commit 89628383b1a05be254c29fadeb6ccfded27e0c77 by anders:
Remove again a test file that was accidentally re-added when resolving a

delete: Tests/FunctionalTests/InvalidLayoutTests.swift

Commit 0b502832f2419d104218a5214e51ee53fee94a9f by github:
More updates for SE-0025 ('fileprivate' and 'private') (#488)

edit: Foundation/Unit.swift


(Michael Gottesman) #2

Can you revert? This is making the linux smoke tests fail.

Michael

···

On Jul 28, 2016, at 6:58 PM, Anders Bertelrud via swift-dev <swift-dev@swift.org> wrote:

I am investigating why 6f0b1047d51e6260967ad06e9ded1fa905d508f4 doesn't seem to have fixed this.

Anders

On Jul 28, 2016, at 18:30, no-reply@swift.org <mailto:no-reply@swift.org> wrote:

[FAILURE] oss-swift-package-linux-ubuntu-14_04 [#1804]

Build URL: https://ci.swift.org/job/oss-swift-package-linux-ubuntu-14_04/1804/
Project: oss-swift-package-linux-ubuntu-14_04
Date of build: Thu, 28 Jul 2016 17:36:21 -0700
Build duration: 54 min
Identified problems:

Regression test failed: This build failed because a regression test in the test suite FAILed. Below is a list of all errors:
Indication 1 <https://ci.swift.org//job/oss-swift-package-linux-ubuntu-14_04/1804/consoleFull#1552161685fca400bf-2f4a-462e-b517-e058d770b2d7>
Indication 2 <https://ci.swift.org//job/oss-swift-package-linux-ubuntu-14_04/1804/consoleFull#1588343159fca400bf-2f4a-462e-b517-e058d770b2d7>
Changes

Commit 3a792f7382a5e8cde26364f3209ec6587f84908f by jordan_rose:
One more 'fileprivate' in newly-added Foundation code.

edit: stdlib/public/SDK/Foundation/IndexPath.swift

Commit 6dea23a02974f73fea98038350eeaa6b1959c13e by jordan_rose:
Flip the switch on 'private' and 'fileprivate' (SE-0025).

edit: validation-test/compiler_crashers_2_fixed/0016-rdar21437203.swift
edit: lib/AST/Decl.cpp
edit: lib/AST/NameLookup.cpp
edit: lib/Sema/TypeCheckDecl.cpp
add: test/Sema/accessibility_private.swift

Commit 2a5b9d65597af5feeb07247967c90e79df7ee50a by jgroff:
Remove now-dead _isBridgedToObjectiveC() declarations in

edit: stdlib/public/core/ImplicitlyUnwrappedOptional.swift
edit: test/SILOptimizer/sil_combine_objc_bridge.sil
edit: test/SILOptimizer/bridging_checked_cast.sil
edit: test/1_stdlib/RuntimeObjC.swift
edit: test/IRGen/Inputs/Foundation.swift
edit: test/1_stdlib/SetTrapsObjC.swift
edit: test/SILGen/collection_upcast.swift
edit: test/1_stdlib/Bridgeable.swift
edit: test/1_stdlib/Inputs/DictionaryKeyValueTypesObjC.swift
edit: test/1_stdlib/DictionaryTrapsObjC.swift
edit: test/Inputs/ObjCBridging/Appliances.swift
edit: test/1_stdlib/DebuggerSupport.swift
edit: stdlib/public/core/BridgeObjectiveC.swift
edit: test/expr/cast/dictionary_bridge.swift
edit: test/Inputs/clang-importer-sdk/swift-modules/Foundation.swift
edit: test/expr/cast/array_downcast.swift
edit: test/Constraints/bridging.swift
edit: test/expr/cast/bridged.swift
edit: test/expr/cast/set_bridge.swift
edit: test/Inputs/clang-importer-sdk/swift-modules-without-ns/Foundation.swift
edit: test/expr/cast/array_bridge.swift
edit: test/1_stdlib/BridgeNonVerbatim.swift
edit: test/SILOptimizer/cast_folding_objc.swift
edit: test/SILGen/collection_downcast.swift
edit: test/SILGen/Inputs/Foundation.swift
edit: test/1_stdlib/ArrayBridge.swift.gyb

Commit d206bb5aa1de732f77cfb470d1c350fdf801b423 by jgroff:
Runtime: Let structural types be cast out of boxed AnyObjects too.

edit: stdlib/public/runtime/Casting.cpp
edit: test/1_stdlib/BridgeIdAsAny.swift.gyb

Commit ef99d39d3b833f890b6df5f3c2ddfe547d0962cb by anthony.parker:
Adapt to UnsafeRawPointer changes in Data initializer and deallocator

edit: stdlib/public/SDK/Foundation/Data.swift

Commit 3dd898f7f08d0cd6a29653e8c78dd92425a02083 by dgregor:
[Constraint application] Don't recompute the type of the a member

edit: lib/Sema/CSApply.cpp

Commit 8c7e75afa044f71bd5b5b5f12284bddd0d907b27 by dgregor:
[AST] Eliminate OverloadedMemberRefExpr.

edit: lib/AST/ASTDumper.cpp
edit: lib/Sema/CSApply.cpp
edit: lib/Sema/CSGen.cpp
edit: lib/AST/ASTWalker.cpp
edit: include/swift/AST/ExprNodes.def
edit: lib/Sema/CSDiag.cpp
edit: lib/AST/Expr.cpp
edit: include/swift/AST/Expr.h

Commit 6f0b1047d51e6260967ad06e9ded1fa905d508f4 by anders:
Updating for SE-0129 Package Manager Test Naming Conventions

edit: swift-package-init-lib.md

Commit fb5f684cc465e342d1876d0506032ae77880431d by anders:
Implement SE-0129 to update the test naming conventions. Instead of

add: Tests/BasicTests/FileSystemTests.swift
delete: Tests/Get/VersionGraphTests.swift
add: Tests/UtilityTests/StringTests.swift
add: Tests/PackageDescriptionTests/VersionTests.swift
delete: Tests/Basic/ByteStringPerfTests.swift
delete: Tests/PackageDescription/PackageTests.swift
delete: Tests/PackageLoading/Inputs/trivial-manifest
delete: Tests/Basic/TOMLTests.swift
delete: Tests/Basic/POSIXTests.swift
add: Tests/UtilityTests/GitTests.swift
delete: Tests/Utility/pkgconfigInputs/gtk+-3.0.pc
add: Tests/CommandsTests/XCTestManifests.swift
add: Tests/PackageDescriptionTests/XCTestManifests.swift
add: Tests/FunctionalTests/MiscellaneousTests.swift
delete: Tests/Functional/ModuleMapTests.swift
delete: Tests/Utility/CollectionTests.swift
add: Tests/GetTests/VersionGraphTests.swift
delete: Tests/PackageDescription/XCTestManifests.swift
add: Tests/UtilityTests/pkgconfigInputs/failure_case.pc
add: Tests/PackageLoadingTests/Inputs/trivial-manifest
delete: Tests/Functional/SwiftPMXCTestHelperTests.swift
delete: Tests/PackageLoading/WhitelistTests.swift
delete: Tests/Commands/TestToolTests.swift
add: Tests/CommandsTests/Utilities.swift
edit: Sources/Commands/init.swift
add: Tests/BuildTests/Utilities.swift
delete: Tests/Build/Utilities.swift
add: Tests/FunctionalTests/XCTestManifests.swift
delete: Tests/Functional/ClangModuleTests.swift
add: Tests/BasicTests/Inputs/regular_text_file
delete: Tests/Basic/LazyCacheTests.swift
delete: Tests/Get/XCTestManifests.swift
delete: Tests/Basic/CollectionAlgorithmsTests.swift
delete: Tests/POSIX/ReaddirTests.swift
delete: Tests/Utility/pkgconfigInputs/failure_case.pc
add: Tests/BasicTests/PathPerfTests.swift
add: Tests/UtilityTests/XCTestManifests.swift
delete: Tests/Basic/XCTestManifests.swift
add: Tests/CommandsTests/BuildToolTests.swift
add: Tests/GetTests/XCTestManifests.swift
delete: Tests/Xcodeproj/FunctionalTests.swift
delete: Tests/PackageLoading/SerializationTests.swift
delete: Tests/Basic/OutputByteStreamPerfTests.swift
delete: Tests/Get/GitTests.swift
add: Tests/BasicTests/Inputs/empty_file
add: Tests/GetTests/GitTests.swift
add: Tests/BasicTests/StringConversionsTests.swift
add: Tests/FunctionalTests/Utilities.swift
delete: Tests/Basic/OrderedSetTests.swift
add: Tests/PackageLoadingTests/ConventionTests.swift
add: Tests/PackageGraphTests/PackageGraphTests.swift
delete: Tests/Basic/StringConversionsTests.swift
delete: Tests/Basic/OptionParserTests.swift
add: Tests/PackageLoadingTests/SerializationTests.swift
add: Tests/FunctionalTests/ValidLayoutTests.swift
add: Tests/UtilityTests/PkgConfigParserTests.swift
delete: Tests/SourceControl/GitRepositoryTests.swift
delete: Tests/Utility/PkgConfigParserTests.swift
add: Tests/PackageDescriptionTests/PackageTests.swift
add: Tests/PackageLoadingTests/Inputs/package-deps-manifest
delete: Tests/PackageLoading/ManifestTests.swift
add: Tests/BuildTests/DescribeTests.swift
add: Tests/PackageLoadingTests/JSONSerializationTests.swift
delete: Tests/Utility/StringTests.swift
add: Fixtures/Miscellaneous/Spaces Fixture/Tests/Moudule Tests/Foo.swift
add: Tests/PackageModelTests/ModuleTests.swift
delete: Fixtures/Miscellaneous/SwiftPMXCTestHelper/Tests/SwiftPMXCTestHelper/SwiftPMXCTestHelperTests.swift
edit: Sources/PackageLoading/PackageBuilder.swift
add: Tests/BasicTests/POSIXTests.swift
add: Tests/BuildTests/PackageVersionDataTests.swift
delete: Tests/Xcodeproj/Utilities.swift
add: Tests/XcodeprojTests/FunctionalTests.swift
delete: Tests/Utility/pkgconfigInputs/deps_variable.pc
delete: Tests/PackageLoading/Inputs/target-deps-manifest
delete: Tests/Basic/TemporaryFileTests.swift
delete: Tests/PackageModel/c99nameTests.swift
delete: Tests/Basic/Inputs/empty_file
add: Tests/BasicTests/OutputByteStreamPerfTests.swift
delete: Tests/Get/Utilities.swift
delete: Tests/SourceControl/XCTestManifests.swift
add: Tests/BasicTests/GraphAlgorithmsTests.swift
add: Tests/PackageLoadingTests/Utilities.swift
add: Tests/FunctionalTests/ClangModuleTests.swift
delete: Tests/PackageLoading/JSONSerializationTests.swift
edit: Fixtures/Miscellaneous/PackageWithInvalidTargets/Tests/LinuxMain.swift
add: Tests/SourceControlTests/XCTestManifests.swift
add: Tests/UtilityTests/CollectionTests.swift
add: Tests/GetTests/GetTests.swift
add: Tests/UtilityTests/pkgconfigInputs/empty_cflags.pc
delete: Tests/Utility/XCTestManifests.swift
delete: Fixtures/Miscellaneous/Spaces Fixture/Tests/Test Module Name/Foo.swift
add: Tests/UtilityTests/Utilities.swift
add: Tests/UtilityTests/pkgconfigInputs/escaped_spaces.pc
delete: Tests/Commands/XCTestManifests.swift
delete: Tests/Basic/OutputByteStreamTests.swift
add: Tests/BasicTests/ThreadTests.swift
delete: Tests/Basic/ByteStringTests.swift
delete: Tests/Basic/FileSystemTests.swift
delete: Tests/PackageLoading/ConventionTests.swift
delete: Tests/SourceControl/CheckoutManagerTests.swift
add: Fixtures/Miscellaneous/SwiftPMXCTestHelper/Tests/SwiftPMXCTestHelperTests/SwiftPMXCTestHelperTests.swift
delete: Tests/Get/GetTests.swift
delete: Tests/Build/DescribeTests.swift
delete: Tests/Build/XCTestManifests.swift
delete: Tests/Commands/BuildToolTests.swift
delete: Tests/Basic/PathTests.swift
delete: Tests/Functional/XCTestManifests.swift
add: Tests/BuildTests/XCTestManifests.swift
add: Tests/FunctionalTests/DependencyResolutionTests.swift
add: Tests/PackageGraphTests/PackageGraph/DependencyResolverTests.swift
add: Tests/BasicTests/OutputByteStreamTests.swift
add: Tests/PackageModelTests/c99nameTests.swift
add: Tests/FunctionalTests/ModuleMapTests.swift
delete: Tests/PackageLoading/ModuleDependencyTests.swift
add: Tests/BasicTests/ByteStringTests.swift
add: Tests/BasicTests/XCTestManifests.swift
delete: Tests/PackageLoading/XCTestManifests.swift
add: Tests/BasicTests/OptionParserTests.swift
add: Tests/PackageLoadingTests/WhitelistTests.swift
delete: Tests/PackageModel/ModuleTests.swift
add: Tests/PackageModelTests/XCTestManifests.swift
delete: Tests/Build/PackageVersionDataTests.swift
delete: Tests/Functional/ValidLayoutTests.swift
delete: Tests/PackageLoading/Inputs/package-deps-manifest
delete: Tests/Basic/SynchronizedQueueTests.swift
delete: Tests/Basic/GraphAlgorithmsTests.swift
delete: Tests/Commands/PackageToolTests.swift
add: Tests/BasicTests/PathTests.swift
add: Tests/BasicTests/SynchronizedQueueTests.swift
delete: Tests/PackageGraph/XCTestManifests.swift
delete: Tests/Basic/Inputs/regular_text_file
add: Tests/UtilityTests/ShellTests.swift
edit: Sources/PackageModel/Module.swift
add: Tests/XcodeprojTests/XCTestManifests.swift
add: Tests/BasicTests/StringConversionsPerfTests.swift
add: Tests/FunctionalTests/InvalidLayoutTests.swift
add: Tests/PackageGraphTests/XCTestManifests.swift
add: Fixtures/Miscellaneous/SwiftPMXCTestHelper/Tests/ObjCTests/ObjCTests.m
add: Tests/PackageLoadingTests/XCTestManifests.swift
add: Tests/BasicTests/PathShimTests.swift
add: Tests/SourceControlTests/GitRepositoryTests.swift
add: Tests/PackageLoadingTests/Inputs/target-deps-manifest
add: Tests/SourceControlTests/CheckoutManagerTests.swift
add: Tests/FunctionalTests/SwiftPMXCTestHelperTests.swift
delete: Tests/Functional/DependencyResolutionTests.swift
add: Tests/BasicTests/CollectionAlgorithmsTests.swift
add: Tests/BasicTests/TemporaryFileTests.swift
delete: Tests/Basic/PathShimTests.swift
add: Tests/BasicTests/LazyCacheTests.swift
delete: Tests/Commands/Utilities.swift
delete: Tests/Functional/Utilities.swift
add: Tests/BasicTests/TOMLTests.swift
delete: Tests/SourceControl/Inputs/TestRepo.tgz
delete: Tests/Utility/Utilities.swift
delete: Tests/Utility/ShellTests.swift
add: Tests/UtilityTests/pkgconfigInputs/deps_variable.pc
add: Tests/GetTests/Utilities.swift
add: Tests/BasicTests/OrderedSetTests.swift
delete: Tests/Basic/PathPerfTests.swift
delete: Tests/PackageModel/XCTestManifests.swift
add: Tests/XcodeprojTests/GenerateXcodeprojTests.swift
add: Tests/BasicTests/ByteStringPerfTests.swift
delete: Tests/Basic/StringConversionsPerfTests.swift
add: Tests/SourceControlTests/Inputs/TestRepo.tgz
add: Tests/POSIXTests/XCTestManifests.swift
add: Tests/BasicTests/LockTests.swift
add: Tests/PackageLoadingTests/ManifestTests.swift
delete: Tests/Functional/MiscellaneousTests.swift
delete: Tests/PackageGraph/DependencyResolverTests.swift
add: Tests/CommandsTests/PackageToolTests.swift
delete: Tests/Utility/GitTests.swift
add: Tests/XcodeprojTests/Utilities.swift
delete: Tests/PackageDescription/VersionTests.swift
delete: Tests/Basic/ThreadTests.swift
delete: Tests/Basic/JSONTests.swift
add: Tests/CommandsTests/TestToolTests.swift
delete: Tests/Utility/pkgconfigInputs/escaped_spaces.pc
delete: Tests/PackageLoading/Utilities.swift
delete: Tests/Xcodeproj/GenerateXcodeprojTests.swift
delete: Tests/Basic/LockTests.swift
add: Tests/POSIXTests/ReaddirTests.swift
delete: Tests/SourceControl/Utilities.swift
add: Tests/BasicTests/JSONTests.swift
delete: Tests/POSIX/XCTestManifests.swift
add: Tests/PackageLoadingTests/ModuleDependencyTests.swift
add: Tests/SourceControlTests/Utilities.swift
delete: Tests/Utility/pkgconfigInputs/empty_cflags.pc
add: Tests/UtilityTests/pkgconfigInputs/gtk+-3.0.pc
delete: Fixtures/Miscellaneous/SwiftPMXCTestHelper/Tests/ObjcTest/Objc.m
delete: Tests/Xcodeproj/XCTestManifests.swift
delete: Tests/PackageGraph/PackageGraphTests.swift
edit: Tests/LinuxMain.swift

Commit 89628383b1a05be254c29fadeb6ccfded27e0c77 by anders:
Remove again a test file that was accidentally re-added when resolving a

delete: Tests/FunctionalTests/InvalidLayoutTests.swift

Commit 0b502832f2419d104218a5214e51ee53fee94a9f by github:
More updates for SE-0025 ('fileprivate' and 'private') (#488)

edit: Foundation/Unit.swift

_______________________________________________
swift-dev mailing list
swift-dev@swift.org <mailto:swift-dev@swift.org>
https://lists.swift.org/mailman/listinfo/swift-dev


(Anders Bertelrud) #3

Pushed a revert until I can figure out why it isn't working.

Anders

···

On 2016-07-28, at 21.42, Michael Gottesman <mgottesman@apple.com> wrote:

Can you revert? This is making the linux smoke tests fail.

Michael

On Jul 28, 2016, at 6:58 PM, Anders Bertelrud via swift-dev <swift-dev@swift.org <mailto:swift-dev@swift.org>> wrote:

I am investigating why 6f0b1047d51e6260967ad06e9ded1fa905d508f4 doesn't seem to have fixed this.

Anders

On Jul 28, 2016, at 18:30, no-reply@swift.org <mailto:no-reply@swift.org> wrote:

[FAILURE] oss-swift-package-linux-ubuntu-14_04 [#1804]

Build URL: https://ci.swift.org/job/oss-swift-package-linux-ubuntu-14_04/1804/
Project: oss-swift-package-linux-ubuntu-14_04
Date of build: Thu, 28 Jul 2016 17:36:21 -0700
Build duration: 54 min
Identified problems:

Regression test failed: This build failed because a regression test in the test suite FAILed. Below is a list of all errors:
Indication 1 <https://ci.swift.org//job/oss-swift-package-linux-ubuntu-14_04/1804/consoleFull#1552161685fca400bf-2f4a-462e-b517-e058d770b2d7>
Indication 2 <https://ci.swift.org//job/oss-swift-package-linux-ubuntu-14_04/1804/consoleFull#1588343159fca400bf-2f4a-462e-b517-e058d770b2d7>
Changes

Commit 3a792f7382a5e8cde26364f3209ec6587f84908f by jordan_rose:
One more 'fileprivate' in newly-added Foundation code.

edit: stdlib/public/SDK/Foundation/IndexPath.swift

Commit 6dea23a02974f73fea98038350eeaa6b1959c13e by jordan_rose:
Flip the switch on 'private' and 'fileprivate' (SE-0025).

edit: validation-test/compiler_crashers_2_fixed/0016-rdar21437203.swift
edit: lib/AST/Decl.cpp
edit: lib/AST/NameLookup.cpp
edit: lib/Sema/TypeCheckDecl.cpp
add: test/Sema/accessibility_private.swift

Commit 2a5b9d65597af5feeb07247967c90e79df7ee50a by jgroff:
Remove now-dead _isBridgedToObjectiveC() declarations in

edit: stdlib/public/core/ImplicitlyUnwrappedOptional.swift
edit: test/SILOptimizer/sil_combine_objc_bridge.sil
edit: test/SILOptimizer/bridging_checked_cast.sil
edit: test/1_stdlib/RuntimeObjC.swift
edit: test/IRGen/Inputs/Foundation.swift
edit: test/1_stdlib/SetTrapsObjC.swift
edit: test/SILGen/collection_upcast.swift
edit: test/1_stdlib/Bridgeable.swift
edit: test/1_stdlib/Inputs/DictionaryKeyValueTypesObjC.swift
edit: test/1_stdlib/DictionaryTrapsObjC.swift
edit: test/Inputs/ObjCBridging/Appliances.swift
edit: test/1_stdlib/DebuggerSupport.swift
edit: stdlib/public/core/BridgeObjectiveC.swift
edit: test/expr/cast/dictionary_bridge.swift
edit: test/Inputs/clang-importer-sdk/swift-modules/Foundation.swift
edit: test/expr/cast/array_downcast.swift
edit: test/Constraints/bridging.swift
edit: test/expr/cast/bridged.swift
edit: test/expr/cast/set_bridge.swift
edit: test/Inputs/clang-importer-sdk/swift-modules-without-ns/Foundation.swift
edit: test/expr/cast/array_bridge.swift
edit: test/1_stdlib/BridgeNonVerbatim.swift
edit: test/SILOptimizer/cast_folding_objc.swift
edit: test/SILGen/collection_downcast.swift
edit: test/SILGen/Inputs/Foundation.swift
edit: test/1_stdlib/ArrayBridge.swift.gyb

Commit d206bb5aa1de732f77cfb470d1c350fdf801b423 by jgroff:
Runtime: Let structural types be cast out of boxed AnyObjects too.

edit: stdlib/public/runtime/Casting.cpp
edit: test/1_stdlib/BridgeIdAsAny.swift.gyb

Commit ef99d39d3b833f890b6df5f3c2ddfe547d0962cb by anthony.parker:
Adapt to UnsafeRawPointer changes in Data initializer and deallocator

edit: stdlib/public/SDK/Foundation/Data.swift

Commit 3dd898f7f08d0cd6a29653e8c78dd92425a02083 by dgregor:
[Constraint application] Don't recompute the type of the a member

edit: lib/Sema/CSApply.cpp

Commit 8c7e75afa044f71bd5b5b5f12284bddd0d907b27 by dgregor:
[AST] Eliminate OverloadedMemberRefExpr.

edit: lib/AST/ASTDumper.cpp
edit: lib/Sema/CSApply.cpp
edit: lib/Sema/CSGen.cpp
edit: lib/AST/ASTWalker.cpp
edit: include/swift/AST/ExprNodes.def
edit: lib/Sema/CSDiag.cpp
edit: lib/AST/Expr.cpp
edit: include/swift/AST/Expr.h

Commit 6f0b1047d51e6260967ad06e9ded1fa905d508f4 by anders:
Updating for SE-0129 Package Manager Test Naming Conventions

edit: swift-package-init-lib.md

Commit fb5f684cc465e342d1876d0506032ae77880431d by anders:
Implement SE-0129 to update the test naming conventions. Instead of

add: Tests/BasicTests/FileSystemTests.swift
delete: Tests/Get/VersionGraphTests.swift
add: Tests/UtilityTests/StringTests.swift
add: Tests/PackageDescriptionTests/VersionTests.swift
delete: Tests/Basic/ByteStringPerfTests.swift
delete: Tests/PackageDescription/PackageTests.swift
delete: Tests/PackageLoading/Inputs/trivial-manifest
delete: Tests/Basic/TOMLTests.swift
delete: Tests/Basic/POSIXTests.swift
add: Tests/UtilityTests/GitTests.swift
delete: Tests/Utility/pkgconfigInputs/gtk+-3.0.pc
add: Tests/CommandsTests/XCTestManifests.swift
add: Tests/PackageDescriptionTests/XCTestManifests.swift
add: Tests/FunctionalTests/MiscellaneousTests.swift
delete: Tests/Functional/ModuleMapTests.swift
delete: Tests/Utility/CollectionTests.swift
add: Tests/GetTests/VersionGraphTests.swift
delete: Tests/PackageDescription/XCTestManifests.swift
add: Tests/UtilityTests/pkgconfigInputs/failure_case.pc
add: Tests/PackageLoadingTests/Inputs/trivial-manifest
delete: Tests/Functional/SwiftPMXCTestHelperTests.swift
delete: Tests/PackageLoading/WhitelistTests.swift
delete: Tests/Commands/TestToolTests.swift
add: Tests/CommandsTests/Utilities.swift
edit: Sources/Commands/init.swift
add: Tests/BuildTests/Utilities.swift
delete: Tests/Build/Utilities.swift
add: Tests/FunctionalTests/XCTestManifests.swift
delete: Tests/Functional/ClangModuleTests.swift
add: Tests/BasicTests/Inputs/regular_text_file
delete: Tests/Basic/LazyCacheTests.swift
delete: Tests/Get/XCTestManifests.swift
delete: Tests/Basic/CollectionAlgorithmsTests.swift
delete: Tests/POSIX/ReaddirTests.swift
delete: Tests/Utility/pkgconfigInputs/failure_case.pc
add: Tests/BasicTests/PathPerfTests.swift
add: Tests/UtilityTests/XCTestManifests.swift
delete: Tests/Basic/XCTestManifests.swift
add: Tests/CommandsTests/BuildToolTests.swift
add: Tests/GetTests/XCTestManifests.swift
delete: Tests/Xcodeproj/FunctionalTests.swift
delete: Tests/PackageLoading/SerializationTests.swift
delete: Tests/Basic/OutputByteStreamPerfTests.swift
delete: Tests/Get/GitTests.swift
add: Tests/BasicTests/Inputs/empty_file
add: Tests/GetTests/GitTests.swift
add: Tests/BasicTests/StringConversionsTests.swift
add: Tests/FunctionalTests/Utilities.swift
delete: Tests/Basic/OrderedSetTests.swift
add: Tests/PackageLoadingTests/ConventionTests.swift
add: Tests/PackageGraphTests/PackageGraphTests.swift
delete: Tests/Basic/StringConversionsTests.swift
delete: Tests/Basic/OptionParserTests.swift
add: Tests/PackageLoadingTests/SerializationTests.swift
add: Tests/FunctionalTests/ValidLayoutTests.swift
add: Tests/UtilityTests/PkgConfigParserTests.swift
delete: Tests/SourceControl/GitRepositoryTests.swift
delete: Tests/Utility/PkgConfigParserTests.swift
add: Tests/PackageDescriptionTests/PackageTests.swift
add: Tests/PackageLoadingTests/Inputs/package-deps-manifest
delete: Tests/PackageLoading/ManifestTests.swift
add: Tests/BuildTests/DescribeTests.swift
add: Tests/PackageLoadingTests/JSONSerializationTests.swift
delete: Tests/Utility/StringTests.swift
add: Fixtures/Miscellaneous/Spaces Fixture/Tests/Moudule Tests/Foo.swift
add: Tests/PackageModelTests/ModuleTests.swift
delete: Fixtures/Miscellaneous/SwiftPMXCTestHelper/Tests/SwiftPMXCTestHelper/SwiftPMXCTestHelperTests.swift
edit: Sources/PackageLoading/PackageBuilder.swift
add: Tests/BasicTests/POSIXTests.swift
add: Tests/BuildTests/PackageVersionDataTests.swift
delete: Tests/Xcodeproj/Utilities.swift
add: Tests/XcodeprojTests/FunctionalTests.swift
delete: Tests/Utility/pkgconfigInputs/deps_variable.pc
delete: Tests/PackageLoading/Inputs/target-deps-manifest
delete: Tests/Basic/TemporaryFileTests.swift
delete: Tests/PackageModel/c99nameTests.swift
delete: Tests/Basic/Inputs/empty_file
add: Tests/BasicTests/OutputByteStreamPerfTests.swift
delete: Tests/Get/Utilities.swift
delete: Tests/SourceControl/XCTestManifests.swift
add: Tests/BasicTests/GraphAlgorithmsTests.swift
add: Tests/PackageLoadingTests/Utilities.swift
add: Tests/FunctionalTests/ClangModuleTests.swift
delete: Tests/PackageLoading/JSONSerializationTests.swift
edit: Fixtures/Miscellaneous/PackageWithInvalidTargets/Tests/LinuxMain.swift
add: Tests/SourceControlTests/XCTestManifests.swift
add: Tests/UtilityTests/CollectionTests.swift
add: Tests/GetTests/GetTests.swift
add: Tests/UtilityTests/pkgconfigInputs/empty_cflags.pc
delete: Tests/Utility/XCTestManifests.swift
delete: Fixtures/Miscellaneous/Spaces Fixture/Tests/Test Module Name/Foo.swift
add: Tests/UtilityTests/Utilities.swift
add: Tests/UtilityTests/pkgconfigInputs/escaped_spaces.pc
delete: Tests/Commands/XCTestManifests.swift
delete: Tests/Basic/OutputByteStreamTests.swift
add: Tests/BasicTests/ThreadTests.swift
delete: Tests/Basic/ByteStringTests.swift
delete: Tests/Basic/FileSystemTests.swift
delete: Tests/PackageLoading/ConventionTests.swift
delete: Tests/SourceControl/CheckoutManagerTests.swift
add: Fixtures/Miscellaneous/SwiftPMXCTestHelper/Tests/SwiftPMXCTestHelperTests/SwiftPMXCTestHelperTests.swift
delete: Tests/Get/GetTests.swift
delete: Tests/Build/DescribeTests.swift
delete: Tests/Build/XCTestManifests.swift
delete: Tests/Commands/BuildToolTests.swift
delete: Tests/Basic/PathTests.swift
delete: Tests/Functional/XCTestManifests.swift
add: Tests/BuildTests/XCTestManifests.swift
add: Tests/FunctionalTests/DependencyResolutionTests.swift
add: Tests/PackageGraphTests/PackageGraph/DependencyResolverTests.swift
add: Tests/BasicTests/OutputByteStreamTests.swift
add: Tests/PackageModelTests/c99nameTests.swift
add: Tests/FunctionalTests/ModuleMapTests.swift
delete: Tests/PackageLoading/ModuleDependencyTests.swift
add: Tests/BasicTests/ByteStringTests.swift
add: Tests/BasicTests/XCTestManifests.swift
delete: Tests/PackageLoading/XCTestManifests.swift
add: Tests/BasicTests/OptionParserTests.swift
add: Tests/PackageLoadingTests/WhitelistTests.swift
delete: Tests/PackageModel/ModuleTests.swift
add: Tests/PackageModelTests/XCTestManifests.swift
delete: Tests/Build/PackageVersionDataTests.swift
delete: Tests/Functional/ValidLayoutTests.swift
delete: Tests/PackageLoading/Inputs/package-deps-manifest
delete: Tests/Basic/SynchronizedQueueTests.swift
delete: Tests/Basic/GraphAlgorithmsTests.swift
delete: Tests/Commands/PackageToolTests.swift
add: Tests/BasicTests/PathTests.swift
add: Tests/BasicTests/SynchronizedQueueTests.swift
delete: Tests/PackageGraph/XCTestManifests.swift
delete: Tests/Basic/Inputs/regular_text_file
add: Tests/UtilityTests/ShellTests.swift
edit: Sources/PackageModel/Module.swift
add: Tests/XcodeprojTests/XCTestManifests.swift
add: Tests/BasicTests/StringConversionsPerfTests.swift
add: Tests/FunctionalTests/InvalidLayoutTests.swift
add: Tests/PackageGraphTests/XCTestManifests.swift
add: Fixtures/Miscellaneous/SwiftPMXCTestHelper/Tests/ObjCTests/ObjCTests.m
add: Tests/PackageLoadingTests/XCTestManifests.swift
add: Tests/BasicTests/PathShimTests.swift
add: Tests/SourceControlTests/GitRepositoryTests.swift
add: Tests/PackageLoadingTests/Inputs/target-deps-manifest
add: Tests/SourceControlTests/CheckoutManagerTests.swift
add: Tests/FunctionalTests/SwiftPMXCTestHelperTests.swift
delete: Tests/Functional/DependencyResolutionTests.swift
add: Tests/BasicTests/CollectionAlgorithmsTests.swift
add: Tests/BasicTests/TemporaryFileTests.swift
delete: Tests/Basic/PathShimTests.swift
add: Tests/BasicTests/LazyCacheTests.swift
delete: Tests/Commands/Utilities.swift
delete: Tests/Functional/Utilities.swift
add: Tests/BasicTests/TOMLTests.swift
delete: Tests/SourceControl/Inputs/TestRepo.tgz
delete: Tests/Utility/Utilities.swift
delete: Tests/Utility/ShellTests.swift
add: Tests/UtilityTests/pkgconfigInputs/deps_variable.pc
add: Tests/GetTests/Utilities.swift
add: Tests/BasicTests/OrderedSetTests.swift
delete: Tests/Basic/PathPerfTests.swift
delete: Tests/PackageModel/XCTestManifests.swift
add: Tests/XcodeprojTests/GenerateXcodeprojTests.swift
add: Tests/BasicTests/ByteStringPerfTests.swift
delete: Tests/Basic/StringConversionsPerfTests.swift
add: Tests/SourceControlTests/Inputs/TestRepo.tgz
add: Tests/POSIXTests/XCTestManifests.swift
add: Tests/BasicTests/LockTests.swift
add: Tests/PackageLoadingTests/ManifestTests.swift
delete: Tests/Functional/MiscellaneousTests.swift
delete: Tests/PackageGraph/DependencyResolverTests.swift
add: Tests/CommandsTests/PackageToolTests.swift
delete: Tests/Utility/GitTests.swift
add: Tests/XcodeprojTests/Utilities.swift
delete: Tests/PackageDescription/VersionTests.swift
delete: Tests/Basic/ThreadTests.swift
delete: Tests/Basic/JSONTests.swift
add: Tests/CommandsTests/TestToolTests.swift
delete: Tests/Utility/pkgconfigInputs/escaped_spaces.pc
delete: Tests/PackageLoading/Utilities.swift
delete: Tests/Xcodeproj/GenerateXcodeprojTests.swift
delete: Tests/Basic/LockTests.swift
add: Tests/POSIXTests/ReaddirTests.swift
delete: Tests/SourceControl/Utilities.swift
add: Tests/BasicTests/JSONTests.swift
delete: Tests/POSIX/XCTestManifests.swift
add: Tests/PackageLoadingTests/ModuleDependencyTests.swift
add: Tests/SourceControlTests/Utilities.swift
delete: Tests/Utility/pkgconfigInputs/empty_cflags.pc
add: Tests/UtilityTests/pkgconfigInputs/gtk+-3.0.pc
delete: Fixtures/Miscellaneous/SwiftPMXCTestHelper/Tests/ObjcTest/Objc.m
delete: Tests/Xcodeproj/XCTestManifests.swift
delete: Tests/PackageGraph/PackageGraphTests.swift
edit: Tests/LinuxMain.swift

Commit 89628383b1a05be254c29fadeb6ccfded27e0c77 by anders:
Remove again a test file that was accidentally re-added when resolving a

delete: Tests/FunctionalTests/InvalidLayoutTests.swift

Commit 0b502832f2419d104218a5214e51ee53fee94a9f by github:
More updates for SE-0025 ('fileprivate' and 'private') (#488)

edit: Foundation/Unit.swift

_______________________________________________
swift-dev mailing list
swift-dev@swift.org <mailto:swift-dev@swift.org>
https://lists.swift.org/mailman/listinfo/swift-dev


(Michael Gottesman) #4

Thanks! I really appreciate it = ).

Michael

···

On Jul 28, 2016, at 9:51 PM, Anders Bertelrud <anders@apple.com> wrote:

Pushed a revert until I can figure out why it isn't working.

Anders

On 2016-07-28, at 21.42, Michael Gottesman <mgottesman@apple.com <mailto:mgottesman@apple.com>> wrote:

Can you revert? This is making the linux smoke tests fail.

Michael

On Jul 28, 2016, at 6:58 PM, Anders Bertelrud via swift-dev <swift-dev@swift.org <mailto:swift-dev@swift.org>> wrote:

I am investigating why 6f0b1047d51e6260967ad06e9ded1fa905d508f4 doesn't seem to have fixed this.

Anders

On Jul 28, 2016, at 18:30, no-reply@swift.org <mailto:no-reply@swift.org> wrote:

[FAILURE] oss-swift-package-linux-ubuntu-14_04 [#1804]

Build URL: https://ci.swift.org/job/oss-swift-package-linux-ubuntu-14_04/1804/
Project: oss-swift-package-linux-ubuntu-14_04
Date of build: Thu, 28 Jul 2016 17:36:21 -0700
Build duration: 54 min
Identified problems:

Regression test failed: This build failed because a regression test in the test suite FAILed. Below is a list of all errors:
Indication 1 <https://ci.swift.org//job/oss-swift-package-linux-ubuntu-14_04/1804/consoleFull#1552161685fca400bf-2f4a-462e-b517-e058d770b2d7>
Indication 2 <https://ci.swift.org//job/oss-swift-package-linux-ubuntu-14_04/1804/consoleFull#1588343159fca400bf-2f4a-462e-b517-e058d770b2d7>
Changes

Commit 3a792f7382a5e8cde26364f3209ec6587f84908f by jordan_rose:
One more 'fileprivate' in newly-added Foundation code.

edit: stdlib/public/SDK/Foundation/IndexPath.swift

Commit 6dea23a02974f73fea98038350eeaa6b1959c13e by jordan_rose:
Flip the switch on 'private' and 'fileprivate' (SE-0025).

edit: validation-test/compiler_crashers_2_fixed/0016-rdar21437203.swift
edit: lib/AST/Decl.cpp
edit: lib/AST/NameLookup.cpp
edit: lib/Sema/TypeCheckDecl.cpp
add: test/Sema/accessibility_private.swift

Commit 2a5b9d65597af5feeb07247967c90e79df7ee50a by jgroff:
Remove now-dead _isBridgedToObjectiveC() declarations in

edit: stdlib/public/core/ImplicitlyUnwrappedOptional.swift
edit: test/SILOptimizer/sil_combine_objc_bridge.sil
edit: test/SILOptimizer/bridging_checked_cast.sil
edit: test/1_stdlib/RuntimeObjC.swift
edit: test/IRGen/Inputs/Foundation.swift
edit: test/1_stdlib/SetTrapsObjC.swift
edit: test/SILGen/collection_upcast.swift
edit: test/1_stdlib/Bridgeable.swift
edit: test/1_stdlib/Inputs/DictionaryKeyValueTypesObjC.swift
edit: test/1_stdlib/DictionaryTrapsObjC.swift
edit: test/Inputs/ObjCBridging/Appliances.swift
edit: test/1_stdlib/DebuggerSupport.swift
edit: stdlib/public/core/BridgeObjectiveC.swift
edit: test/expr/cast/dictionary_bridge.swift
edit: test/Inputs/clang-importer-sdk/swift-modules/Foundation.swift
edit: test/expr/cast/array_downcast.swift
edit: test/Constraints/bridging.swift
edit: test/expr/cast/bridged.swift
edit: test/expr/cast/set_bridge.swift
edit: test/Inputs/clang-importer-sdk/swift-modules-without-ns/Foundation.swift
edit: test/expr/cast/array_bridge.swift
edit: test/1_stdlib/BridgeNonVerbatim.swift
edit: test/SILOptimizer/cast_folding_objc.swift
edit: test/SILGen/collection_downcast.swift
edit: test/SILGen/Inputs/Foundation.swift
edit: test/1_stdlib/ArrayBridge.swift.gyb

Commit d206bb5aa1de732f77cfb470d1c350fdf801b423 by jgroff:
Runtime: Let structural types be cast out of boxed AnyObjects too.

edit: stdlib/public/runtime/Casting.cpp
edit: test/1_stdlib/BridgeIdAsAny.swift.gyb

Commit ef99d39d3b833f890b6df5f3c2ddfe547d0962cb by anthony.parker:
Adapt to UnsafeRawPointer changes in Data initializer and deallocator

edit: stdlib/public/SDK/Foundation/Data.swift

Commit 3dd898f7f08d0cd6a29653e8c78dd92425a02083 by dgregor:
[Constraint application] Don't recompute the type of the a member

edit: lib/Sema/CSApply.cpp

Commit 8c7e75afa044f71bd5b5b5f12284bddd0d907b27 by dgregor:
[AST] Eliminate OverloadedMemberRefExpr.

edit: lib/AST/ASTDumper.cpp
edit: lib/Sema/CSApply.cpp
edit: lib/Sema/CSGen.cpp
edit: lib/AST/ASTWalker.cpp
edit: include/swift/AST/ExprNodes.def
edit: lib/Sema/CSDiag.cpp
edit: lib/AST/Expr.cpp
edit: include/swift/AST/Expr.h

Commit 6f0b1047d51e6260967ad06e9ded1fa905d508f4 by anders:
Updating for SE-0129 Package Manager Test Naming Conventions

edit: swift-package-init-lib.md

Commit fb5f684cc465e342d1876d0506032ae77880431d by anders:
Implement SE-0129 to update the test naming conventions. Instead of

add: Tests/BasicTests/FileSystemTests.swift
delete: Tests/Get/VersionGraphTests.swift
add: Tests/UtilityTests/StringTests.swift
add: Tests/PackageDescriptionTests/VersionTests.swift
delete: Tests/Basic/ByteStringPerfTests.swift
delete: Tests/PackageDescription/PackageTests.swift
delete: Tests/PackageLoading/Inputs/trivial-manifest
delete: Tests/Basic/TOMLTests.swift
delete: Tests/Basic/POSIXTests.swift
add: Tests/UtilityTests/GitTests.swift
delete: Tests/Utility/pkgconfigInputs/gtk+-3.0.pc
add: Tests/CommandsTests/XCTestManifests.swift
add: Tests/PackageDescriptionTests/XCTestManifests.swift
add: Tests/FunctionalTests/MiscellaneousTests.swift
delete: Tests/Functional/ModuleMapTests.swift
delete: Tests/Utility/CollectionTests.swift
add: Tests/GetTests/VersionGraphTests.swift
delete: Tests/PackageDescription/XCTestManifests.swift
add: Tests/UtilityTests/pkgconfigInputs/failure_case.pc
add: Tests/PackageLoadingTests/Inputs/trivial-manifest
delete: Tests/Functional/SwiftPMXCTestHelperTests.swift
delete: Tests/PackageLoading/WhitelistTests.swift
delete: Tests/Commands/TestToolTests.swift
add: Tests/CommandsTests/Utilities.swift
edit: Sources/Commands/init.swift
add: Tests/BuildTests/Utilities.swift
delete: Tests/Build/Utilities.swift
add: Tests/FunctionalTests/XCTestManifests.swift
delete: Tests/Functional/ClangModuleTests.swift
add: Tests/BasicTests/Inputs/regular_text_file
delete: Tests/Basic/LazyCacheTests.swift
delete: Tests/Get/XCTestManifests.swift
delete: Tests/Basic/CollectionAlgorithmsTests.swift
delete: Tests/POSIX/ReaddirTests.swift
delete: Tests/Utility/pkgconfigInputs/failure_case.pc
add: Tests/BasicTests/PathPerfTests.swift
add: Tests/UtilityTests/XCTestManifests.swift
delete: Tests/Basic/XCTestManifests.swift
add: Tests/CommandsTests/BuildToolTests.swift
add: Tests/GetTests/XCTestManifests.swift
delete: Tests/Xcodeproj/FunctionalTests.swift
delete: Tests/PackageLoading/SerializationTests.swift
delete: Tests/Basic/OutputByteStreamPerfTests.swift
delete: Tests/Get/GitTests.swift
add: Tests/BasicTests/Inputs/empty_file
add: Tests/GetTests/GitTests.swift
add: Tests/BasicTests/StringConversionsTests.swift
add: Tests/FunctionalTests/Utilities.swift
delete: Tests/Basic/OrderedSetTests.swift
add: Tests/PackageLoadingTests/ConventionTests.swift
add: Tests/PackageGraphTests/PackageGraphTests.swift
delete: Tests/Basic/StringConversionsTests.swift
delete: Tests/Basic/OptionParserTests.swift
add: Tests/PackageLoadingTests/SerializationTests.swift
add: Tests/FunctionalTests/ValidLayoutTests.swift
add: Tests/UtilityTests/PkgConfigParserTests.swift
delete: Tests/SourceControl/GitRepositoryTests.swift
delete: Tests/Utility/PkgConfigParserTests.swift
add: Tests/PackageDescriptionTests/PackageTests.swift
add: Tests/PackageLoadingTests/Inputs/package-deps-manifest
delete: Tests/PackageLoading/ManifestTests.swift
add: Tests/BuildTests/DescribeTests.swift
add: Tests/PackageLoadingTests/JSONSerializationTests.swift
delete: Tests/Utility/StringTests.swift
add: Fixtures/Miscellaneous/Spaces Fixture/Tests/Moudule Tests/Foo.swift
add: Tests/PackageModelTests/ModuleTests.swift
delete: Fixtures/Miscellaneous/SwiftPMXCTestHelper/Tests/SwiftPMXCTestHelper/SwiftPMXCTestHelperTests.swift
edit: Sources/PackageLoading/PackageBuilder.swift
add: Tests/BasicTests/POSIXTests.swift
add: Tests/BuildTests/PackageVersionDataTests.swift
delete: Tests/Xcodeproj/Utilities.swift
add: Tests/XcodeprojTests/FunctionalTests.swift
delete: Tests/Utility/pkgconfigInputs/deps_variable.pc
delete: Tests/PackageLoading/Inputs/target-deps-manifest
delete: Tests/Basic/TemporaryFileTests.swift
delete: Tests/PackageModel/c99nameTests.swift
delete: Tests/Basic/Inputs/empty_file
add: Tests/BasicTests/OutputByteStreamPerfTests.swift
delete: Tests/Get/Utilities.swift
delete: Tests/SourceControl/XCTestManifests.swift
add: Tests/BasicTests/GraphAlgorithmsTests.swift
add: Tests/PackageLoadingTests/Utilities.swift
add: Tests/FunctionalTests/ClangModuleTests.swift
delete: Tests/PackageLoading/JSONSerializationTests.swift
edit: Fixtures/Miscellaneous/PackageWithInvalidTargets/Tests/LinuxMain.swift
add: Tests/SourceControlTests/XCTestManifests.swift
add: Tests/UtilityTests/CollectionTests.swift
add: Tests/GetTests/GetTests.swift
add: Tests/UtilityTests/pkgconfigInputs/empty_cflags.pc
delete: Tests/Utility/XCTestManifests.swift
delete: Fixtures/Miscellaneous/Spaces Fixture/Tests/Test Module Name/Foo.swift
add: Tests/UtilityTests/Utilities.swift
add: Tests/UtilityTests/pkgconfigInputs/escaped_spaces.pc
delete: Tests/Commands/XCTestManifests.swift
delete: Tests/Basic/OutputByteStreamTests.swift
add: Tests/BasicTests/ThreadTests.swift
delete: Tests/Basic/ByteStringTests.swift
delete: Tests/Basic/FileSystemTests.swift
delete: Tests/PackageLoading/ConventionTests.swift
delete: Tests/SourceControl/CheckoutManagerTests.swift
add: Fixtures/Miscellaneous/SwiftPMXCTestHelper/Tests/SwiftPMXCTestHelperTests/SwiftPMXCTestHelperTests.swift
delete: Tests/Get/GetTests.swift
delete: Tests/Build/DescribeTests.swift
delete: Tests/Build/XCTestManifests.swift
delete: Tests/Commands/BuildToolTests.swift
delete: Tests/Basic/PathTests.swift
delete: Tests/Functional/XCTestManifests.swift
add: Tests/BuildTests/XCTestManifests.swift
add: Tests/FunctionalTests/DependencyResolutionTests.swift
add: Tests/PackageGraphTests/PackageGraph/DependencyResolverTests.swift
add: Tests/BasicTests/OutputByteStreamTests.swift
add: Tests/PackageModelTests/c99nameTests.swift
add: Tests/FunctionalTests/ModuleMapTests.swift
delete: Tests/PackageLoading/ModuleDependencyTests.swift
add: Tests/BasicTests/ByteStringTests.swift
add: Tests/BasicTests/XCTestManifests.swift
delete: Tests/PackageLoading/XCTestManifests.swift
add: Tests/BasicTests/OptionParserTests.swift
add: Tests/PackageLoadingTests/WhitelistTests.swift
delete: Tests/PackageModel/ModuleTests.swift
add: Tests/PackageModelTests/XCTestManifests.swift
delete: Tests/Build/PackageVersionDataTests.swift
delete: Tests/Functional/ValidLayoutTests.swift
delete: Tests/PackageLoading/Inputs/package-deps-manifest
delete: Tests/Basic/SynchronizedQueueTests.swift
delete: Tests/Basic/GraphAlgorithmsTests.swift
delete: Tests/Commands/PackageToolTests.swift
add: Tests/BasicTests/PathTests.swift
add: Tests/BasicTests/SynchronizedQueueTests.swift
delete: Tests/PackageGraph/XCTestManifests.swift
delete: Tests/Basic/Inputs/regular_text_file
add: Tests/UtilityTests/ShellTests.swift
edit: Sources/PackageModel/Module.swift
add: Tests/XcodeprojTests/XCTestManifests.swift
add: Tests/BasicTests/StringConversionsPerfTests.swift
add: Tests/FunctionalTests/InvalidLayoutTests.swift
add: Tests/PackageGraphTests/XCTestManifests.swift
add: Fixtures/Miscellaneous/SwiftPMXCTestHelper/Tests/ObjCTests/ObjCTests.m
add: Tests/PackageLoadingTests/XCTestManifests.swift
add: Tests/BasicTests/PathShimTests.swift
add: Tests/SourceControlTests/GitRepositoryTests.swift
add: Tests/PackageLoadingTests/Inputs/target-deps-manifest
add: Tests/SourceControlTests/CheckoutManagerTests.swift
add: Tests/FunctionalTests/SwiftPMXCTestHelperTests.swift
delete: Tests/Functional/DependencyResolutionTests.swift
add: Tests/BasicTests/CollectionAlgorithmsTests.swift
add: Tests/BasicTests/TemporaryFileTests.swift
delete: Tests/Basic/PathShimTests.swift
add: Tests/BasicTests/LazyCacheTests.swift
delete: Tests/Commands/Utilities.swift
delete: Tests/Functional/Utilities.swift
add: Tests/BasicTests/TOMLTests.swift
delete: Tests/SourceControl/Inputs/TestRepo.tgz
delete: Tests/Utility/Utilities.swift
delete: Tests/Utility/ShellTests.swift
add: Tests/UtilityTests/pkgconfigInputs/deps_variable.pc
add: Tests/GetTests/Utilities.swift
add: Tests/BasicTests/OrderedSetTests.swift
delete: Tests/Basic/PathPerfTests.swift
delete: Tests/PackageModel/XCTestManifests.swift
add: Tests/XcodeprojTests/GenerateXcodeprojTests.swift
add: Tests/BasicTests/ByteStringPerfTests.swift
delete: Tests/Basic/StringConversionsPerfTests.swift
add: Tests/SourceControlTests/Inputs/TestRepo.tgz
add: Tests/POSIXTests/XCTestManifests.swift
add: Tests/BasicTests/LockTests.swift
add: Tests/PackageLoadingTests/ManifestTests.swift
delete: Tests/Functional/MiscellaneousTests.swift
delete: Tests/PackageGraph/DependencyResolverTests.swift
add: Tests/CommandsTests/PackageToolTests.swift
delete: Tests/Utility/GitTests.swift
add: Tests/XcodeprojTests/Utilities.swift
delete: Tests/PackageDescription/VersionTests.swift
delete: Tests/Basic/ThreadTests.swift
delete: Tests/Basic/JSONTests.swift
add: Tests/CommandsTests/TestToolTests.swift
delete: Tests/Utility/pkgconfigInputs/escaped_spaces.pc
delete: Tests/PackageLoading/Utilities.swift
delete: Tests/Xcodeproj/GenerateXcodeprojTests.swift
delete: Tests/Basic/LockTests.swift
add: Tests/POSIXTests/ReaddirTests.swift
delete: Tests/SourceControl/Utilities.swift
add: Tests/BasicTests/JSONTests.swift
delete: Tests/POSIX/XCTestManifests.swift
add: Tests/PackageLoadingTests/ModuleDependencyTests.swift
add: Tests/SourceControlTests/Utilities.swift
delete: Tests/Utility/pkgconfigInputs/empty_cflags.pc
add: Tests/UtilityTests/pkgconfigInputs/gtk+-3.0.pc
delete: Fixtures/Miscellaneous/SwiftPMXCTestHelper/Tests/ObjcTest/Objc.m
delete: Tests/Xcodeproj/XCTestManifests.swift
delete: Tests/PackageGraph/PackageGraphTests.swift
edit: Tests/LinuxMain.swift

Commit 89628383b1a05be254c29fadeb6ccfded27e0c77 by anders:
Remove again a test file that was accidentally re-added when resolving a

delete: Tests/FunctionalTests/InvalidLayoutTests.swift

Commit 0b502832f2419d104218a5214e51ee53fee94a9f by github:
More updates for SE-0025 ('fileprivate' and 'private') (#488)

edit: Foundation/Unit.swift

_______________________________________________
swift-dev mailing list
swift-dev@swift.org <mailto:swift-dev@swift.org>
https://lists.swift.org/mailman/listinfo/swift-dev


(Anders Bertelrud) #5

Sorry for the delay. I can't see in the log what's causing the test command to fail (stdout and stderr are empty), so will need to get to the bottom of it before I reenable.

Anders

···

On 2016-07-28, at 22.01, Michael Gottesman <mgottesman@apple.com> wrote:

Thanks! I really appreciate it = ).

Michael

On Jul 28, 2016, at 9:51 PM, Anders Bertelrud <anders@apple.com <mailto:anders@apple.com>> wrote:

Pushed a revert until I can figure out why it isn't working.

Anders

On 2016-07-28, at 21.42, Michael Gottesman <mgottesman@apple.com <mailto:mgottesman@apple.com>> wrote:

Can you revert? This is making the linux smoke tests fail.

Michael

On Jul 28, 2016, at 6:58 PM, Anders Bertelrud via swift-dev <swift-dev@swift.org <mailto:swift-dev@swift.org>> wrote:

I am investigating why 6f0b1047d51e6260967ad06e9ded1fa905d508f4 doesn't seem to have fixed this.

Anders

On Jul 28, 2016, at 18:30, no-reply@swift.org <mailto:no-reply@swift.org> wrote:

[FAILURE] oss-swift-package-linux-ubuntu-14_04 [#1804]

Build URL: https://ci.swift.org/job/oss-swift-package-linux-ubuntu-14_04/1804/
Project: oss-swift-package-linux-ubuntu-14_04
Date of build: Thu, 28 Jul 2016 17:36:21 -0700
Build duration: 54 min
Identified problems:

Regression test failed: This build failed because a regression test in the test suite FAILed. Below is a list of all errors:
Indication 1 <https://ci.swift.org//job/oss-swift-package-linux-ubuntu-14_04/1804/consoleFull#1552161685fca400bf-2f4a-462e-b517-e058d770b2d7>
Indication 2 <https://ci.swift.org//job/oss-swift-package-linux-ubuntu-14_04/1804/consoleFull#1588343159fca400bf-2f4a-462e-b517-e058d770b2d7>
Changes

Commit 3a792f7382a5e8cde26364f3209ec6587f84908f by jordan_rose:
One more 'fileprivate' in newly-added Foundation code.

edit: stdlib/public/SDK/Foundation/IndexPath.swift

Commit 6dea23a02974f73fea98038350eeaa6b1959c13e by jordan_rose:
Flip the switch on 'private' and 'fileprivate' (SE-0025).

edit: validation-test/compiler_crashers_2_fixed/0016-rdar21437203.swift
edit: lib/AST/Decl.cpp
edit: lib/AST/NameLookup.cpp
edit: lib/Sema/TypeCheckDecl.cpp
add: test/Sema/accessibility_private.swift

Commit 2a5b9d65597af5feeb07247967c90e79df7ee50a by jgroff:
Remove now-dead _isBridgedToObjectiveC() declarations in

edit: stdlib/public/core/ImplicitlyUnwrappedOptional.swift
edit: test/SILOptimizer/sil_combine_objc_bridge.sil
edit: test/SILOptimizer/bridging_checked_cast.sil
edit: test/1_stdlib/RuntimeObjC.swift
edit: test/IRGen/Inputs/Foundation.swift
edit: test/1_stdlib/SetTrapsObjC.swift
edit: test/SILGen/collection_upcast.swift
edit: test/1_stdlib/Bridgeable.swift
edit: test/1_stdlib/Inputs/DictionaryKeyValueTypesObjC.swift
edit: test/1_stdlib/DictionaryTrapsObjC.swift
edit: test/Inputs/ObjCBridging/Appliances.swift
edit: test/1_stdlib/DebuggerSupport.swift
edit: stdlib/public/core/BridgeObjectiveC.swift
edit: test/expr/cast/dictionary_bridge.swift
edit: test/Inputs/clang-importer-sdk/swift-modules/Foundation.swift
edit: test/expr/cast/array_downcast.swift
edit: test/Constraints/bridging.swift
edit: test/expr/cast/bridged.swift
edit: test/expr/cast/set_bridge.swift
edit: test/Inputs/clang-importer-sdk/swift-modules-without-ns/Foundation.swift
edit: test/expr/cast/array_bridge.swift
edit: test/1_stdlib/BridgeNonVerbatim.swift
edit: test/SILOptimizer/cast_folding_objc.swift
edit: test/SILGen/collection_downcast.swift
edit: test/SILGen/Inputs/Foundation.swift
edit: test/1_stdlib/ArrayBridge.swift.gyb

Commit d206bb5aa1de732f77cfb470d1c350fdf801b423 by jgroff:
Runtime: Let structural types be cast out of boxed AnyObjects too.

edit: stdlib/public/runtime/Casting.cpp
edit: test/1_stdlib/BridgeIdAsAny.swift.gyb

Commit ef99d39d3b833f890b6df5f3c2ddfe547d0962cb by anthony.parker:
Adapt to UnsafeRawPointer changes in Data initializer and deallocator

edit: stdlib/public/SDK/Foundation/Data.swift

Commit 3dd898f7f08d0cd6a29653e8c78dd92425a02083 by dgregor:
[Constraint application] Don't recompute the type of the a member

edit: lib/Sema/CSApply.cpp

Commit 8c7e75afa044f71bd5b5b5f12284bddd0d907b27 by dgregor:
[AST] Eliminate OverloadedMemberRefExpr.

edit: lib/AST/ASTDumper.cpp
edit: lib/Sema/CSApply.cpp
edit: lib/Sema/CSGen.cpp
edit: lib/AST/ASTWalker.cpp
edit: include/swift/AST/ExprNodes.def
edit: lib/Sema/CSDiag.cpp
edit: lib/AST/Expr.cpp
edit: include/swift/AST/Expr.h

Commit 6f0b1047d51e6260967ad06e9ded1fa905d508f4 by anders:
Updating for SE-0129 Package Manager Test Naming Conventions

edit: swift-package-init-lib.md

Commit fb5f684cc465e342d1876d0506032ae77880431d by anders:
Implement SE-0129 to update the test naming conventions. Instead of

add: Tests/BasicTests/FileSystemTests.swift
delete: Tests/Get/VersionGraphTests.swift
add: Tests/UtilityTests/StringTests.swift
add: Tests/PackageDescriptionTests/VersionTests.swift
delete: Tests/Basic/ByteStringPerfTests.swift
delete: Tests/PackageDescription/PackageTests.swift
delete: Tests/PackageLoading/Inputs/trivial-manifest
delete: Tests/Basic/TOMLTests.swift
delete: Tests/Basic/POSIXTests.swift
add: Tests/UtilityTests/GitTests.swift
delete: Tests/Utility/pkgconfigInputs/gtk+-3.0.pc
add: Tests/CommandsTests/XCTestManifests.swift
add: Tests/PackageDescriptionTests/XCTestManifests.swift
add: Tests/FunctionalTests/MiscellaneousTests.swift
delete: Tests/Functional/ModuleMapTests.swift
delete: Tests/Utility/CollectionTests.swift
add: Tests/GetTests/VersionGraphTests.swift
delete: Tests/PackageDescription/XCTestManifests.swift
add: Tests/UtilityTests/pkgconfigInputs/failure_case.pc
add: Tests/PackageLoadingTests/Inputs/trivial-manifest
delete: Tests/Functional/SwiftPMXCTestHelperTests.swift
delete: Tests/PackageLoading/WhitelistTests.swift
delete: Tests/Commands/TestToolTests.swift
add: Tests/CommandsTests/Utilities.swift
edit: Sources/Commands/init.swift
add: Tests/BuildTests/Utilities.swift
delete: Tests/Build/Utilities.swift
add: Tests/FunctionalTests/XCTestManifests.swift
delete: Tests/Functional/ClangModuleTests.swift
add: Tests/BasicTests/Inputs/regular_text_file
delete: Tests/Basic/LazyCacheTests.swift
delete: Tests/Get/XCTestManifests.swift
delete: Tests/Basic/CollectionAlgorithmsTests.swift
delete: Tests/POSIX/ReaddirTests.swift
delete: Tests/Utility/pkgconfigInputs/failure_case.pc
add: Tests/BasicTests/PathPerfTests.swift
add: Tests/UtilityTests/XCTestManifests.swift
delete: Tests/Basic/XCTestManifests.swift
add: Tests/CommandsTests/BuildToolTests.swift
add: Tests/GetTests/XCTestManifests.swift
delete: Tests/Xcodeproj/FunctionalTests.swift
delete: Tests/PackageLoading/SerializationTests.swift
delete: Tests/Basic/OutputByteStreamPerfTests.swift
delete: Tests/Get/GitTests.swift
add: Tests/BasicTests/Inputs/empty_file
add: Tests/GetTests/GitTests.swift
add: Tests/BasicTests/StringConversionsTests.swift
add: Tests/FunctionalTests/Utilities.swift
delete: Tests/Basic/OrderedSetTests.swift
add: Tests/PackageLoadingTests/ConventionTests.swift
add: Tests/PackageGraphTests/PackageGraphTests.swift
delete: Tests/Basic/StringConversionsTests.swift
delete: Tests/Basic/OptionParserTests.swift
add: Tests/PackageLoadingTests/SerializationTests.swift
add: Tests/FunctionalTests/ValidLayoutTests.swift
add: Tests/UtilityTests/PkgConfigParserTests.swift
delete: Tests/SourceControl/GitRepositoryTests.swift
delete: Tests/Utility/PkgConfigParserTests.swift
add: Tests/PackageDescriptionTests/PackageTests.swift
add: Tests/PackageLoadingTests/Inputs/package-deps-manifest
delete: Tests/PackageLoading/ManifestTests.swift
add: Tests/BuildTests/DescribeTests.swift
add: Tests/PackageLoadingTests/JSONSerializationTests.swift
delete: Tests/Utility/StringTests.swift
add: Fixtures/Miscellaneous/Spaces Fixture/Tests/Moudule Tests/Foo.swift
add: Tests/PackageModelTests/ModuleTests.swift
delete: Fixtures/Miscellaneous/SwiftPMXCTestHelper/Tests/SwiftPMXCTestHelper/SwiftPMXCTestHelperTests.swift
edit: Sources/PackageLoading/PackageBuilder.swift
add: Tests/BasicTests/POSIXTests.swift
add: Tests/BuildTests/PackageVersionDataTests.swift
delete: Tests/Xcodeproj/Utilities.swift
add: Tests/XcodeprojTests/FunctionalTests.swift
delete: Tests/Utility/pkgconfigInputs/deps_variable.pc
delete: Tests/PackageLoading/Inputs/target-deps-manifest
delete: Tests/Basic/TemporaryFileTests.swift
delete: Tests/PackageModel/c99nameTests.swift
delete: Tests/Basic/Inputs/empty_file
add: Tests/BasicTests/OutputByteStreamPerfTests.swift
delete: Tests/Get/Utilities.swift
delete: Tests/SourceControl/XCTestManifests.swift
add: Tests/BasicTests/GraphAlgorithmsTests.swift
add: Tests/PackageLoadingTests/Utilities.swift
add: Tests/FunctionalTests/ClangModuleTests.swift
delete: Tests/PackageLoading/JSONSerializationTests.swift
edit: Fixtures/Miscellaneous/PackageWithInvalidTargets/Tests/LinuxMain.swift
add: Tests/SourceControlTests/XCTestManifests.swift
add: Tests/UtilityTests/CollectionTests.swift
add: Tests/GetTests/GetTests.swift
add: Tests/UtilityTests/pkgconfigInputs/empty_cflags.pc
delete: Tests/Utility/XCTestManifests.swift
delete: Fixtures/Miscellaneous/Spaces Fixture/Tests/Test Module Name/Foo.swift
add: Tests/UtilityTests/Utilities.swift
add: Tests/UtilityTests/pkgconfigInputs/escaped_spaces.pc
delete: Tests/Commands/XCTestManifests.swift
delete: Tests/Basic/OutputByteStreamTests.swift
add: Tests/BasicTests/ThreadTests.swift
delete: Tests/Basic/ByteStringTests.swift
delete: Tests/Basic/FileSystemTests.swift
delete: Tests/PackageLoading/ConventionTests.swift
delete: Tests/SourceControl/CheckoutManagerTests.swift
add: Fixtures/Miscellaneous/SwiftPMXCTestHelper/Tests/SwiftPMXCTestHelperTests/SwiftPMXCTestHelperTests.swift
delete: Tests/Get/GetTests.swift
delete: Tests/Build/DescribeTests.swift
delete: Tests/Build/XCTestManifests.swift
delete: Tests/Commands/BuildToolTests.swift
delete: Tests/Basic/PathTests.swift
delete: Tests/Functional/XCTestManifests.swift
add: Tests/BuildTests/XCTestManifests.swift
add: Tests/FunctionalTests/DependencyResolutionTests.swift
add: Tests/PackageGraphTests/PackageGraph/DependencyResolverTests.swift
add: Tests/BasicTests/OutputByteStreamTests.swift
add: Tests/PackageModelTests/c99nameTests.swift
add: Tests/FunctionalTests/ModuleMapTests.swift
delete: Tests/PackageLoading/ModuleDependencyTests.swift
add: Tests/BasicTests/ByteStringTests.swift
add: Tests/BasicTests/XCTestManifests.swift
delete: Tests/PackageLoading/XCTestManifests.swift
add: Tests/BasicTests/OptionParserTests.swift
add: Tests/PackageLoadingTests/WhitelistTests.swift
delete: Tests/PackageModel/ModuleTests.swift
add: Tests/PackageModelTests/XCTestManifests.swift
delete: Tests/Build/PackageVersionDataTests.swift
delete: Tests/Functional/ValidLayoutTests.swift
delete: Tests/PackageLoading/Inputs/package-deps-manifest
delete: Tests/Basic/SynchronizedQueueTests.swift
delete: Tests/Basic/GraphAlgorithmsTests.swift
delete: Tests/Commands/PackageToolTests.swift
add: Tests/BasicTests/PathTests.swift
add: Tests/BasicTests/SynchronizedQueueTests.swift
delete: Tests/PackageGraph/XCTestManifests.swift
delete: Tests/Basic/Inputs/regular_text_file
add: Tests/UtilityTests/ShellTests.swift
edit: Sources/PackageModel/Module.swift
add: Tests/XcodeprojTests/XCTestManifests.swift
add: Tests/BasicTests/StringConversionsPerfTests.swift
add: Tests/FunctionalTests/InvalidLayoutTests.swift
add: Tests/PackageGraphTests/XCTestManifests.swift
add: Fixtures/Miscellaneous/SwiftPMXCTestHelper/Tests/ObjCTests/ObjCTests.m
add: Tests/PackageLoadingTests/XCTestManifests.swift
add: Tests/BasicTests/PathShimTests.swift
add: Tests/SourceControlTests/GitRepositoryTests.swift
add: Tests/PackageLoadingTests/Inputs/target-deps-manifest
add: Tests/SourceControlTests/CheckoutManagerTests.swift
add: Tests/FunctionalTests/SwiftPMXCTestHelperTests.swift
delete: Tests/Functional/DependencyResolutionTests.swift
add: Tests/BasicTests/CollectionAlgorithmsTests.swift
add: Tests/BasicTests/TemporaryFileTests.swift
delete: Tests/Basic/PathShimTests.swift
add: Tests/BasicTests/LazyCacheTests.swift
delete: Tests/Commands/Utilities.swift
delete: Tests/Functional/Utilities.swift
add: Tests/BasicTests/TOMLTests.swift
delete: Tests/SourceControl/Inputs/TestRepo.tgz
delete: Tests/Utility/Utilities.swift
delete: Tests/Utility/ShellTests.swift
add: Tests/UtilityTests/pkgconfigInputs/deps_variable.pc
add: Tests/GetTests/Utilities.swift
add: Tests/BasicTests/OrderedSetTests.swift
delete: Tests/Basic/PathPerfTests.swift
delete: Tests/PackageModel/XCTestManifests.swift
add: Tests/XcodeprojTests/GenerateXcodeprojTests.swift
add: Tests/BasicTests/ByteStringPerfTests.swift
delete: Tests/Basic/StringConversionsPerfTests.swift
add: Tests/SourceControlTests/Inputs/TestRepo.tgz
add: Tests/POSIXTests/XCTestManifests.swift
add: Tests/BasicTests/LockTests.swift
add: Tests/PackageLoadingTests/ManifestTests.swift
delete: Tests/Functional/MiscellaneousTests.swift
delete: Tests/PackageGraph/DependencyResolverTests.swift
add: Tests/CommandsTests/PackageToolTests.swift
delete: Tests/Utility/GitTests.swift
add: Tests/XcodeprojTests/Utilities.swift
delete: Tests/PackageDescription/VersionTests.swift
delete: Tests/Basic/ThreadTests.swift
delete: Tests/Basic/JSONTests.swift
add: Tests/CommandsTests/TestToolTests.swift
delete: Tests/Utility/pkgconfigInputs/escaped_spaces.pc
delete: Tests/PackageLoading/Utilities.swift
delete: Tests/Xcodeproj/GenerateXcodeprojTests.swift
delete: Tests/Basic/LockTests.swift
add: Tests/POSIXTests/ReaddirTests.swift
delete: Tests/SourceControl/Utilities.swift
add: Tests/BasicTests/JSONTests.swift
delete: Tests/POSIX/XCTestManifests.swift
add: Tests/PackageLoadingTests/ModuleDependencyTests.swift
add: Tests/SourceControlTests/Utilities.swift
delete: Tests/Utility/pkgconfigInputs/empty_cflags.pc
add: Tests/UtilityTests/pkgconfigInputs/gtk+-3.0.pc
delete: Fixtures/Miscellaneous/SwiftPMXCTestHelper/Tests/ObjcTest/Objc.m
delete: Tests/Xcodeproj/XCTestManifests.swift
delete: Tests/PackageGraph/PackageGraphTests.swift
edit: Tests/LinuxMain.swift

Commit 89628383b1a05be254c29fadeb6ccfded27e0c77 by anders:
Remove again a test file that was accidentally re-added when resolving a

delete: Tests/FunctionalTests/InvalidLayoutTests.swift

Commit 0b502832f2419d104218a5214e51ee53fee94a9f by github:
More updates for SE-0025 ('fileprivate' and 'private') (#488)

edit: Foundation/Unit.swift

_______________________________________________
swift-dev mailing list
swift-dev@swift.org <mailto:swift-dev@swift.org>
https://lists.swift.org/mailman/listinfo/swift-dev