[Swift CI] Build Failure: OSS - Swift Package - OS X (swift 4.0) #583

Report

[FAILURE] oss-swift-4.0-package-osx [#583]

Build URL:
https://ci.swift.org/job/oss-swift-4.0-package-osx/583/
Project:
oss-swift-4.0-package-osx
Date of build:
Thu, 09 Nov 2017 16:15:28 -0600
Build duration:
1 hr 38 min

Identified problems:

  • Regression test failed: This build failed because a regression test in the test suite FAILed. Below is a list of all errors:

Changes

  • No Changes

******************** TEST 'Swift(iphonesimulator-x86_64) :: stdlib/ModelIO.swift' FAILED ********************
Script:

ยทยทยท

--
rm -rf /Users/buildnode/jenkins/workspace/oss-swift-4.0-package-osx/build/buildbot_osx/swift-macosx-x86_64/validation-test-iphonesimulator-x86_64/stdlib/Output/ModelIO.swift.tmp && mkdir -p /Users/buildnode/jenkins/workspace/oss-swift-4.0-package-osx/build/buildbot_osx/swift-macosx-x86_64/validation-test-iphonesimulator-x86_64/stdlib/Output/ModelIO.swift.tmp && xcrun --toolchain default --sdk /Applications/Xcode-beta.app/Contents/Developer/Platforms/iPhoneSimulator.platform/Developer/SDKs/iPhoneSimulator11.2.sdk /Users/buildnode/jenkins/workspace/oss-swift-4.0-package-osx/build/buildbot_osx/swift-macosx-x86_64/bin/swiftc -target x86_64-apple-ios7.0 -module-cache-path '/var/folders/_8/79jmzf2142z2xydc_01btlx00000gn/T/swift-testsuite-clang-module-cachehFYsA7' -F /Applications/Xcode-beta.app/Contents/Developer/Platforms/iPhoneSimulator.platform/Developer/SDKs/iPhoneSimulator11.2.sdk/../../../Developer/Library/Frameworks -swift-version 3 -module-cache-path '/var/folders/_8/79jmzf2142z2xydc_01btlx00000gn/T/swift-testsuite-clang-module-cachehFYsA7' /Users/buildnode/jenkins/workspace/oss-swift-4.0-package-osx/swift/validation-test/stdlib/ModelIO.swift -o /Users/buildnode/jenkins/workspace/oss-swift-4.0-package-osx/build/buildbot_osx/swift-macosx-x86_64/validation-test-iphonesimulator-x86_64/stdlib/Output/ModelIO.swift.tmp/a.out -module-name main && xcrun --toolchain default --sdk /Applications/Xcode-beta.app/Contents/Developer/Platforms/iPhoneSimulator.platform/Developer/SDKs/iPhoneSimulator11.2.sdk simctl spawn 'iPhone 6' /Users/buildnode/jenkins/workspace/oss-swift-4.0-package-osx/build/buildbot_osx/swift-macosx-x86_64/validation-test-iphonesimulator-x86_64/stdlib/Output/ModelIO.swift.tmp/a.out
--
Exit Code: 134

On Nov 9, 2017, at 3:54 PM, no-reply@swift.org wrote:

[FAILURE] oss-swift-4.0-package-osx [#583]

Build URL: https://ci.swift.org/job/oss-swift-4.0-package-osx/583/
Project: oss-swift-4.0-package-osx
Date of build: Thu, 09 Nov 2017 16:15:28 -0600
Build duration: 1 hr 38 min
Identified problems:

Regression test failed: This build failed because a regression test in the test suite FAILed. Below is a list of all errors:
Indication 1 <https://ci.swift.org//job/oss-swift-4.0-package-osx/583/consoleFull#-169438179ba62d58e-7248-467b-91e0-c7508d5cf947>
Changes

No Changes