[Swift CI] Build Failure: OSS - Swift Package - OS X (master) #451

Report

[FAILURE] oss-swift-package-osx [#451]

Build URL:
https://ci.swift.org/job/oss-swift-package-osx/451/
Project:
oss-swift-package-osx
Date of build:
Mon, 09 Oct 2017 04:59:55 -0500
Build duration:
1 hr 35 min

Identified problems:

  • Regression test failed: This build failed because a regression test in the test suite FAILed. Below is a list of all errors:

Changes

  • Commit e76b34e506ee8c284924a90d539825baea3643ca by spestov:
    SILOptimizer: Devirtualizer support for witness thunks with a

    • add: test/SILOptimizer/devirt_class_witness_method.sil
    • edit: lib/SILOptimizer/Utils/Devirtualize.cpp
  • Commit 3a8d484a77e3bb02577cbc7d180e9c74b97106e7 by spestov:
    Sema: Compute RequirementEnvironment when we are matching a witness

    • edit: lib/Sema/TypeCheckProtocol.cpp
  • Commit b5f231dfb0db72c028c63e3edca442ba96f2e415 by spestov:
    Sema: Track if the protocol witness for a class conformance is in a

    • edit: lib/Sema/TypeCheckProtocol.cpp
  • Commit b145d40329a1eb464f0df8648da1707bdad02085 by spestov:
    Sema: Requirement environments for protocol extension members in class

    • edit: test/Interpreter/protocol_extensions.swift
    • edit: lib/Sema/TypeCheckProtocol.cpp
    • edit: test/SILGen/witnesses_class.swift
    • edit: test/SILGen/protocol_extensions.swift
  • Commit 21868c17ca88c144226b2e79227793f13b952bc1 by spestov:
    Sema: Factor out ConformanceChecker::checkNonFinalClassWitness() from

    • edit: lib/Sema/TypeCheckProtocol.cpp
  • Commit 216011437e74b476277a966c616a485c70859419 by spestov:
    Sema: ConformanceChecker::Adoptee is always nominal

    • edit: lib/Sema/TypeCheckProtocol.cpp
  • Commit 80ada277078dd63907519c78dabeb21d9ae73bcd by spestov:
    Sema: Lift restriction on classes conforming to protocols with default

    • add: test/decl/protocol/conforms/self.swift
    • edit: lib/Sema/TypeCheckProtocol.cpp
    • edit: include/swift/AST/DiagnosticsSema.def
  • Commit f8b06dceb217af1a8bbbca14850df63dc9e0c455 by spestov:
    Fix REQUIRES: line in

    • edit: validation-test/compiler_crashers_fixed/26725-llvm-smallvectorimpl-swift-diagnosticargument-operator.swift
  • Commit dd6335811224ea23c06e11dd3f5d225c52a6a186 by practicalswift:
    [swiftc (60 vs. 5600)] Add crasher in

    • add: validation-test/compiler_crashers/28854-known-typewitnesses-end-didnt-resolve-witness.swift
  • Commit 11dd19e9a9ae953ccd405d4b362b5b1279fd191d by practicalswift:
    [swiftc (61 vs. 5600)] Add crasher in

    • add: validation-test/compiler_crashers/28855-swift-genericsignaturebuilder-addrequirement-swift-requirementrepr-const-swift-g.swift

New issue found!

New issue found!

New issue found!

UNREACHABLE executed at /Users/buildnode/jenkins/workspace/oss-swift-package-osx/swift/lib/IRGen/IRGenDebugInfo.cpp:1408!
0 swift 0x0000000106d477f8 llvm::sys::PrintStackTrace(llvm::raw_ostream&) + 40
1 swift 0x0000000106d46746 llvm::sys::RunSignalHandlers() + 86
2 swift 0x0000000106d47dbe SignalHandler(int) + 366
3 libsystem_platform.dylib 0x00007fffe6c65b3a _sigtramp + 26
4 libsystem_platform.dylib 0x000000010b650551 _sigtramp + 614378033
5 libsystem_c.dylib 0x00007fffe6aea420 abort + 129
6 swift 0x0000000106ce9f60 LLVMInstallFatalErrorHandler + 0
7 swift 0x0000000103a90b1b (anonymous namespace)::IRGenDebugInfoImpl::getOrCreateType(swift::irgen::DebugTypeInfo) + 2635
8 swift 0x0000000103a8bdba (anonymous namespace)::IRGenDebugInfoImpl::emitVariableDeclaration(swift::irgen::IRBuilder&, llvm::ArrayRef<llvm::Value*>, swift::irgen::DebugTypeInfo, swift::SILDebugScope const*, swift::ValueDecl*, llvm::StringRef, unsigned int, swift::irgen::IndirectionKind, swift::irgen::ArtificialKind) + 698
9 swift 0x0000000103a8bae8 swift::irgen::IRGenDebugInfo::emitVariableDeclaration(swift::irgen::IRBuilder&, llvm::ArrayRef<llvm::Value*>, swift::irgen::DebugTypeInfo, swift::SILDebugScope const*, swift::ValueDecl*, llvm::StringRef, unsigned int, swift::irgen::IndirectionKind, swift::irgen::ArtificialKind) + 120
10 swift 0x0000000103aba4ef swift::SILInstructionVisitor<(anonymous namespace)::IRGenSILFunction, void>::visit(swift::SILInstruction*) + 54255
11 swift 0x0000000103aa9c12 (anonymous namespace)::IRGenSILFunction::emitSILFunction() + 6962
12 swift 0x0000000103aa7bdd swift::irgen::IRGenModule::emitSILFunction(swift::SILFunction*) + 1341
13 swift 0x00000001039ca0ab swift::irgen::IRGenerator::emitLazyDefinitions() + 827
14 swift 0x0000000103a84626 performIRGeneration(swift::IRGenOptions&, swift::ModuleDecl*, std::__1::unique_ptr<swift::SILModule, std::__1::default_delete<swift::SILModule> >, llvm::StringRef, llvm::LLVMContext&, swift::SourceFile*, llvm::GlobalVariable**, unsigned int) + 1350
15 swift 0x0000000103a84bf6 swift::performIRGeneration(swift::IRGenOptions&, swift::SourceFile&, std::__1::unique_ptr<swift::SILModule, std::__1::default_delete<swift::SILModule> >, llvm::StringRef, llvm::LLVMContext&, unsigned int, llvm::GlobalVariable**) + 86
16 swift 0x0000000103944e77 performCompile(swift::CompilerInstance&, swift::CompilerInvocation&, llvm::ArrayRef<char const*>, int&, swift::FrontendObserver*, swift::UnifiedStatsReporter*) + 13783
17 swift 0x000000010394099b swift::performFrontend(llvm::ArrayRef<char const*>, char const*, void*, swift::FrontendObserver*) + 3339
18 swift 0x0000000103901860 main + 3360
19 libdyld.dylib 0x00007fffe6a56235 start + 1
20 libdyld.dylib 0x0000000000000032 start + 425369086
Stack dump:
0. Program arguments: /Users/buildnode/jenkins/workspace/oss-swift-package-osx/build/buildbot_osx/swift-macosx-x86_64/bin/swift -frontend -c /Users/buildnode/jenkins/workspace/oss-swift-package-osx/swiftpm/Sources/PackageLoading/Diagnostics.swift /Users/buildnode/jenkins/workspace/oss-swift-package-osx/swiftpm/Sources/PackageLoading/ManifestLoader.swift /Users/buildnode/jenkins/workspace/oss-swift-package-osx/swiftpm/Sources/PackageLoading/Module+PkgConfig.swift /Users/buildnode/jenkins/workspace/oss-swift-package-osx/swiftpm/Sources/PackageLoading/ModuleMapGenerator.swift -primary-file /Users/buildnode/jenkins/workspace/oss-swift-package-osx/swiftpm/Sources/PackageLoading/PackageBuilder.swift /Users/buildnode/jenkins/workspace/oss-swift-package-osx/swiftpm/Sources/PackageLoading/PackageDescription4Loader.swift /Users/buildnode/jenkins/workspace/oss-swift-package-osx/swiftpm/Sources/PackageLoading/PackageDescriptionLoader.swift /Users/buildnode/jenkins/workspace/oss-swift-package-osx/swiftpm/Sources/PackageLoading/ToolsVersionLoader.swift /Users/buildnode/jenkins/workspace/oss-swift-package-osx/swiftpm/Sources/PackageLoading/VersionShim.swift -target x86_64-apple-macosx10.10 -enable-objc-interop -sdk /Applications/Xcode.app/Contents/Developer/Platforms/MacOSX.platform/Developer/SDKs/MacOSX10.13.sdk -I /Users/buildnode/jenkins/workspace/oss-swift-package-osx/build/buildbot_osx/swiftpm-macosx-x86_64/x86_64-apple-macosx10.10/debug -I /Users/buildnode/jenkins/workspace/oss-swift-package-osx/swiftpm/Sources/clibc/include -F /Applications/Xcode.app/Contents/Developer/Platforms/MacOSX.platform/Developer/Library/Frameworks -enable-testing -g -module-cache-path /Users/buildnode/jenkins/workspace/oss-swift-package-osx/build/buildbot_osx/swiftpm-macosx-x86_64/x86_64-apple-macosx10.10/debug/ModuleCache -swift-version 3 -Onone -D SWIFT_PACKAGE -Xcc -fmodule-map-file=/Users/buildnode/jenkins/workspace/oss-swift-package-osx/swiftpm/Sources/clibc/include/module.modulemap -emit-module-doc-path /Users/buildnode/jenkins/workspace/oss-swift-package-osx/build/buildbot_osx/swiftpm-macosx-x86_64/x86_64-apple-macosx10.10/debug/PackageLoading.build/PackageBuilder~partial.swiftdoc -parse-as-library -module-name PackageLoading -emit-module-path /Users/buildnode/jenkins/workspace/oss-swift-package-osx/build/buildbot_osx/swiftpm-macosx-x86_64/x86_64-apple-macosx10.10/debug/PackageLoading.build/PackageBuilder~partial.swiftmodule -emit-dependencies-path /Users/buildnode/jenkins/workspace/oss-swift-package-osx/build/buildbot_osx/swiftpm-macosx-x86_64/x86_64-apple-macosx10.10/debug/PackageLoading.build/PackageBuilder.d -emit-reference-dependencies-path /Users/buildnode/jenkins/workspace/oss-swift-package-osx/build/buildbot_osx/swiftpm-macosx-x86_64/x86_64-apple-macosx10.10/debug/PackageLoading.build/PackageBuilder.swiftdeps -num-threads 8 -o /Users/buildnode/jenkins/workspace/oss-swift-package-osx/build/buildbot_osx/swiftpm-macosx-x86_64/x86_64-apple-macosx10.10/debug/PackageLoading.build/PackageBuilder.swift.o
1. While emitting IR SIL function "@_T014PackageLoading0A7BuilderC21findTargetSpecialDirs33_FB9B47161A0CF6A5C9B98CA15DDA085DLLSS9targetDir_SS04testeR0tSay0A5Model0E0CGF".
for 'findTargetSpecialDirs(_:)' at /Users/buildnode/jenkins/workspace/oss-swift-package-osx/swiftpm/Sources/PackageLoading/PackageBuilder.swift:262:13
<><unknown>:0: error: unable to execute command: Abort trap: 6

Thanks,
Mishal Shah

ยทยทยท

On Oct 9, 2017, at 10:49 AM, no-reply@swift.org wrote:

New issue found!

[FAILURE] oss-swift-package-osx [#454]

Build URL: https://ci.swift.org/job/oss-swift-package-osx/454/
Project: oss-swift-package-osx
Date of build: Mon, 09 Oct 2017 11:47:17 -0500
Build duration: 1 hr 3 min
Identified problems:

Assertion failure: This build failed because of an assertion failure. Below is a list of all errors in the build log:
Indication 1 <https://ci.swift.org//job/oss-swift-package-osx/454/consoleFull#1409455219ef3c3c00-f496-40b9-85a7-0eb69d0f491b>
Compile Error: This build failed because of a compile error. Below is a list of all errors in the build log:
Indication 1 <https://ci.swift.org//job/oss-swift-package-osx/454/consoleFull#5770858633122a513-f36a-4c87-8ed7-cbc36a1ec144>
Changes

Commit 49c65facc9de1cd5f24c4cf27f982dcd36f58c06 by jsbustos:
[PrintAsObjC] Attempt at fixing SR-5018: marking +new unavailable when

edit: lib/PrintAsObjC/PrintAsObjC.cpp
edit: test/PrintAsObjC/availability.swift
edit: test/PrintAsObjC/protocols.swift
edit: test/PrintAsObjC/classes.swift

Commit f400eca69249e2775b971c7ff0473a51c340cbad by github:
Fix incorrect variable name

edit: lib/PrintAsObjC/PrintAsObjC.cpp

Commit 0aea1c0528ae7667e4af494ac0de7ded3865533d by aprantl:
Debug Info: Represent private discriminators in DWARF.

edit: lib/IRGen/IRGenDebugInfo.cpp
edit: lib/AST/Decl.cpp
edit: lib/AST/ASTMangler.cpp
edit: include/swift/AST/Decl.h
edit: test/DebugInfo/PrivateDiscriminator.swift