[Swift CI] Build Failure: OSS - Swift Package - OS X (master) #3418


(no-reply@swift.org) #1

Report

[FAILURE] oss-swift-package-osx [#3418]

Build URL:
https://ci.swift.org/job/oss-swift-package-osx/3418/
Project:
oss-swift-package-osx
Date of build:
Sun, 21 May 2017 23:17:54 -0700
Build duration:
3 hr 13 min

Changes

  • Commit 5728f3367a61952273df7b7f9374b8e4c56c0244 by Slava Pestov:
    Sema: Fix for typealiases in protocols not getting a generic environment

    • edit: lib/Sema/TypeCheckDecl.cpp
  • Commit ca6e4e61381779c094331f08067f814af64a3bd1 by Slava Pestov:
    Sema: Clean up openGeneric() for nested generic types

    • edit: lib/Sema/ConstraintSystem.h
    • edit: lib/Sema/ConstraintSystem.cpp
    • edit: lib/Sema/CSRanking.cpp
    • edit: lib/Sema/TypeCheckProtocol.cpp
  • Commit cde493de0da84b10313e0e6674cc38fd8a771bf6 by Slava Pestov:
    Sema: Support member types in preCheckExpression()

    • edit: test/type/array.swift
    • edit: test/IDE/complete_from_swift_module.swift
    • edit: test/ClangImporter/enum-with-target.swift
    • edit: test/SourceKit/Sema/sema_module.swift
    • edit: lib/Sema/TypeCheckConstraints.cpp
    • edit: test/decl/typealias/generic.swift
    • edit: test/Generics/invalid.swift
    • edit: test/type/protocol_composition.swift
  • Commit ec12e974ee2af2547d1092182cc1d104f426319c by Slava Pestov:
    Sema: More consistent enforcement of ‘.self’ on metatype values in Swift

    • edit: lib/Sema/MiscDiagnostics.cpp
    • edit: test/Parse/type_expr.swift
    • add: test/Compatibility/type_expr.swift
  • Commit 76a005587b14c195b2800d64f01eb9970502ef56 by Slava Pestov:
    Sema: Specialization of nested types in expression context

    • edit: test/decl/typealias/generic.swift
    • edit: test/Parse/generic_disambiguation.swift
    • edit: test/Constraints/generics.swift
    • edit: lib/Sema/TypeCheckConstraints.cpp
    • edit: test/Parse/enum_element_pattern_swift4.swift
    • edit: lib/Sema/CSGen.cpp
    • edit: test/type/array.swift
  • Commit 0c474eb68124e266849a81f9de761fb0a8384a59 by Slava Pestov:
    Sema: Move some code from preCheckExpression() pass to static methods on

    • edit: include/swift/AST/Expr.h
    • edit: lib/AST/Expr.cpp
    • edit: lib/Sema/CSGen.cpp
    • edit: lib/Sema/TypeCheckConstraints.cpp
  • Commit 0eac6f0178129898efabb3afe111453158e6de57 by Slava Pestov:
    Sema: Factor out some duplication in member type lookup

    • edit: lib/Sema/TypeCheckConstraints.cpp
    • edit: lib/Sema/TypeCheckType.cpp

(Joe Shajrawi) #2

Seems like a code sign issue popped up on multiple package bots?

Regards,
—Joe |  | :e-mail: shajrawi@apple.com | :iphone:(+1) 408-930-5203

···

On May 22, 2017, at 2:31 AM, no-reply@swift.org wrote:

[FAILURE] oss-swift-package-osx [#3418]

Build URL: https://ci.swift.org/job/oss-swift-package-osx/3418/
Project: oss-swift-package-osx
Date of build: Sun, 21 May 2017 23:17:54 -0700
Build duration: 3 hr 13 min

Changes

Commit 5728f3367a61952273df7b7f9374b8e4c56c0244 by Slava Pestov:
Sema: Fix for typealiases in protocols not getting a generic environment

edit: lib/Sema/TypeCheckDecl.cpp

Commit ca6e4e61381779c094331f08067f814af64a3bd1 by Slava Pestov:
Sema: Clean up openGeneric() for nested generic types

edit: lib/Sema/ConstraintSystem.h
edit: lib/Sema/ConstraintSystem.cpp
edit: lib/Sema/CSRanking.cpp
edit: lib/Sema/TypeCheckProtocol.cpp

Commit cde493de0da84b10313e0e6674cc38fd8a771bf6 by Slava Pestov:
Sema: Support member types in preCheckExpression()

edit: test/type/array.swift
edit: test/IDE/complete_from_swift_module.swift
edit: test/ClangImporter/enum-with-target.swift
edit: test/SourceKit/Sema/sema_module.swift
edit: lib/Sema/TypeCheckConstraints.cpp
edit: test/decl/typealias/generic.swift
edit: test/Generics/invalid.swift
edit: test/type/protocol_composition.swift

Commit ec12e974ee2af2547d1092182cc1d104f426319c by Slava Pestov:
Sema: More consistent enforcement of '.self' on metatype values in Swift

edit: lib/Sema/MiscDiagnostics.cpp
edit: test/Parse/type_expr.swift
add: test/Compatibility/type_expr.swift

Commit 76a005587b14c195b2800d64f01eb9970502ef56 by Slava Pestov:
Sema: Specialization of nested types in expression context

edit: test/decl/typealias/generic.swift
edit: test/Parse/generic_disambiguation.swift
edit: test/Constraints/generics.swift
edit: lib/Sema/TypeCheckConstraints.cpp
edit: test/Parse/enum_element_pattern_swift4.swift
edit: lib/Sema/CSGen.cpp
edit: test/type/array.swift

Commit 0c474eb68124e266849a81f9de761fb0a8384a59 by Slava Pestov:
Sema: Move some code from preCheckExpression() pass to static methods on

edit: include/swift/AST/Expr.h
edit: lib/AST/Expr.cpp
edit: lib/Sema/CSGen.cpp
edit: lib/Sema/TypeCheckConstraints.cpp

Commit 0eac6f0178129898efabb3afe111453158e6de57 by Slava Pestov:
Sema: Factor out some duplication in member type lookup

edit: lib/Sema/TypeCheckConstraints.cpp
edit: lib/Sema/TypeCheckType.cpp


(Joe Shajrawi) #3

Sorry it is actually No space left on device after code sign - filed a radar
-- scp code sign pkg --
Killed by signal 1.
Killed by signal 1.
Killed by signal 1.
Killed by signal 1.
scp: /www-data/tmp-builds/swift-DEVELOPMENT-SNAPSHOT-2017-05-21-a-3123/xcode/swift-DEVELOPMENT-SNAPSHOT-2017-05-21-a/swift-DEVELOPMENT-SNAPSHOT-2017-05-21-a-osx-symbols.pkg: No space left on device

Regards,
—Joe |  | :e-mail: shajrawi@apple.com | :iphone:(+1) 408-930-5203

···

On May 22, 2017, at 2:31 AM, no-reply@swift.org wrote:

[FAILURE] oss-swift-package-osx [#3418]

Build URL: https://ci.swift.org/job/oss-swift-package-osx/3418/
Project: oss-swift-package-osx
Date of build: Sun, 21 May 2017 23:17:54 -0700
Build duration: 3 hr 13 min

Changes

Commit 5728f3367a61952273df7b7f9374b8e4c56c0244 by Slava Pestov:
Sema: Fix for typealiases in protocols not getting a generic environment

edit: lib/Sema/TypeCheckDecl.cpp

Commit ca6e4e61381779c094331f08067f814af64a3bd1 by Slava Pestov:
Sema: Clean up openGeneric() for nested generic types

edit: lib/Sema/ConstraintSystem.h
edit: lib/Sema/ConstraintSystem.cpp
edit: lib/Sema/CSRanking.cpp
edit: lib/Sema/TypeCheckProtocol.cpp

Commit cde493de0da84b10313e0e6674cc38fd8a771bf6 by Slava Pestov:
Sema: Support member types in preCheckExpression()

edit: test/type/array.swift
edit: test/IDE/complete_from_swift_module.swift
edit: test/ClangImporter/enum-with-target.swift
edit: test/SourceKit/Sema/sema_module.swift
edit: lib/Sema/TypeCheckConstraints.cpp
edit: test/decl/typealias/generic.swift
edit: test/Generics/invalid.swift
edit: test/type/protocol_composition.swift

Commit ec12e974ee2af2547d1092182cc1d104f426319c by Slava Pestov:
Sema: More consistent enforcement of '.self' on metatype values in Swift

edit: lib/Sema/MiscDiagnostics.cpp
edit: test/Parse/type_expr.swift
add: test/Compatibility/type_expr.swift

Commit 76a005587b14c195b2800d64f01eb9970502ef56 by Slava Pestov:
Sema: Specialization of nested types in expression context

edit: test/decl/typealias/generic.swift
edit: test/Parse/generic_disambiguation.swift
edit: test/Constraints/generics.swift
edit: lib/Sema/TypeCheckConstraints.cpp
edit: test/Parse/enum_element_pattern_swift4.swift
edit: lib/Sema/CSGen.cpp
edit: test/type/array.swift

Commit 0c474eb68124e266849a81f9de761fb0a8384a59 by Slava Pestov:
Sema: Move some code from preCheckExpression() pass to static methods on

edit: include/swift/AST/Expr.h
edit: lib/AST/Expr.cpp
edit: lib/Sema/CSGen.cpp
edit: lib/Sema/TypeCheckConstraints.cpp

Commit 0eac6f0178129898efabb3afe111453158e6de57 by Slava Pestov:
Sema: Factor out some duplication in member type lookup

edit: lib/Sema/TypeCheckConstraints.cpp
edit: lib/Sema/TypeCheckType.cpp