[Swift CI] Build Failure: 2. Swift Source Compatibility Suite (master) (Debug) #2766

Report

[FAILURE] swift-master-source-compat-suite-debug [#2766]

Build URL:
https://ci.swift.org/job/swift-master-source-compat-suite-debug/2766/
Project:
swift-master-source-compat-suite-debug
Date of build:
Thu, 26 Mar 2020 12:07:19 -0500
Build duration:
38 min

Identified problems:

  • Jenkins Error: This build failed because of a Jenkins Error; typically a Java exception.

Changes

  • Commit 8b03b05f1d4bd1d28f9b13ff4f207c0c3bfc913a by nhawes:
    [Index] Add index support for cross import overlays.

    • add: test/Index/Inputs/CrossImport/B.framework/Modules/B.swiftmodule/module-triple-here.swiftinterface
    • edit: tools/SourceKit/lib/SwiftLang/SwiftSourceDocInfo.cpp
    • edit: lib/Index/IndexRecord.cpp
    • add: test/Index/index_cross_import.swift
    • add: test/Index/Inputs/CrossImport/C.framework/Modules/C.swiftmodule/module-triple-here.swiftinterface
    • add: test/Index/Inputs/CrossImport/_ABAdditions.framework/Modules/_ABAdditions.swiftmodule/module-triple-here.swiftinterface
    • edit: lib/AST/Module.cpp
    • edit: lib/IDE/CodeCompletion.cpp
    • add: test/Index/Inputs/CrossImport/_ABAdditions.framework/Modules/_ABAdditions.swiftcrossimport/C.swiftoverlay
    • add: test/Index/Inputs/CrossImport/A.framework/Modules/A.swiftmodule/module-triple-here.swiftinterface
    • add: test/Index/Inputs/CrossImport/A.framework/Modules/A.swiftcrossimport/B.swiftoverlay
    • edit: lib/Index/Index.cpp
    • add: test/Index/Store/cross-import-overlay.swift
    • add: test/Index/Inputs/CrossImport/__ABAdditionsCAdditions.framework/Modules/__ABAdditionsCAdditions.swiftmodule/module-triple-here.swiftinterface
  • Commit a785fa6cee29461493945e4f03f9dfff4724ba5c by nhawes:
    [Frontend][Index] Add frontend option to skip indexing the stdlib (for

    • edit: include/swift/Option/FrontendOptions.td
    • edit: lib/Index/IndexRecord.cpp
    • edit: test/Index/Store/driver-index-with-auxiliary-outputs.swift
    • edit: lib/Frontend/ArgsToFrontendOptionsConverter.cpp
    • edit: include/swift/Index/IndexRecord.h
    • edit: test/Index/index_swift_only_systemmodule.swift
    • edit: include/swift/Frontend/FrontendOptions.h
    • edit: lib/FrontendTool/FrontendTool.cpp
    • edit: test/Index/Store/cross-import-overlay.swift
  • Commit 95be170e4635f9184e6206afd955eca0996fb414 by pyaskevich:
    [CSApply] Support dynamic member lookup as component of key path dynamic

    • edit: test/attr/attr_dynamic_member_lookup.swift
    • edit: lib/Sema/CSApply.cpp
  • Commit 45dc14a275016b80ad338e5ee40cfda43c7c4cb2 by nhawes:
    [Index][test] Fix test/Index/Store/cross-import-overly.swift to handle

    • edit: test/Index/Store/cross-import-overlay.swift
  • Commit ebe0a455836365b1a0a81ffaca24a84f806ef6a1 by xi_ge:
    PrintAsObjC: use header path relative to usr/include when importing

    • edit: lib/PrintAsObjC/PrintAsObjC.cpp
    • add: test/Inputs/clang-importer-sdk/usr/include/CTypesCore/values.h
    • edit: test/PrintAsObjC/imports.swift
    • add: test/Inputs/clang-importer-sdk/usr/include/CTypesCore/module.modulemap
  • Commit 7b7599a28de4f2dec785a139eef75953b908e191 by rishizaki:
    [CodeCompletion] Don't run second pass for decls in closures

    • add: test/SourceKit/CodeComplete/complete_sequence_func_in_closure.swift
    • edit: lib/Parse/ParseExpr.cpp
  • Commit 75691d641e6e5d0571e48421edd5986c6d2d2cac by github:
    [AutoDiff upstream] Add linear function SIL instructions (#30638)

    • edit: lib/SILOptimizer/Utils/SILInliner.cpp
    • edit: lib/Serialization/SerializeSIL.cpp
    • edit: lib/SIL/OperandOwnership.cpp
    • edit: lib/SIL/SILPrinter.cpp
    • edit: lib/SIL/SILInstructions.cpp
    • edit: lib/SIL/SILVerifier.cpp
    • edit: lib/ParseSIL/ParseSIL.cpp
    • edit: lib/SIL/ValueOwnership.cpp
    • edit: include/swift/SIL/SILNodes.def
    • edit: lib/IRGen/IRGenSIL.cpp
    • add: test/AutoDiff/SIL/linear_function_inst.sil
    • edit: lib/SILOptimizer/UtilityPasses/SerializeSILPass.cpp
    • edit: include/swift/SIL/SILCloner.h
    • edit: include/swift/SIL/SILBuilder.h
    • edit: include/swift/SIL/SILInstruction.h
    • edit: docs/SIL.rst
    • edit: lib/Serialization/ModuleFormat.h
    • edit: lib/Serialization/SILFormat.h
    • edit: lib/Serialization/DeserializeSIL.cpp
    • edit: include/swift/AST/DiagnosticsParse.def
**12:45:39** FATAL: command execution failed
**12:45:39** java.io.EOFException
**12:45:39** 	at java.io.ObjectInputStream$PeekInputStream.readFully(ObjectInputStream.java:2735)
**12:45:39** 	at java.io.ObjectInputStream$BlockDataInputStream.readShort(ObjectInputStream.java:3210)
**12:45:39** 	at java.io.ObjectInputStream.readStreamHeader(ObjectInputStream.java:895)
**12:45:39** 	at java.io.ObjectInputStream.<init>(ObjectInputStream.java:357)
**12:45:39** 	at hudson.remoting.ObjectInputStreamEx.<init>(ObjectInputStreamEx.java:49)
**12:45:39** 	at hudson.remoting.Command.readFrom(Command.java:140)
**12:45:39** 	at hudson.remoting.Command.readFrom(Command.java:126)
**12:45:39** 	at hudson.remoting.AbstractSynchronousByteArrayCommandTransport.read(AbstractSynchronousByteArrayCommandTransport.java:36)
**12:45:39** 	at hudson.remoting.SynchronousCommandTransport$ReaderThread.run(SynchronousCommandTransport.java:63)
**12:45:39** Caused: java.io.IOException: Unexpected termination of the channel
**12:45:39** 	at hudson.remoting.SynchronousCommandTransport$ReaderThread.run(SynchronousCommandTransport.java:77)
**12:45:39** Caused: java.io.IOException: Backing channel 'macOS-25' is disconnected.
**12:45:39** 	at hudson.remoting.RemoteInvocationHandler.channelOrFail(RemoteInvocationHandler.java:214)
**12:45:39** 	at hudson.remoting.RemoteInvocationHandler.invoke(RemoteInvocationHandler.java:283)
**12:45:39** 	at com.sun.proxy.$Proxy73.isAlive(Unknown Source)
**12:45:39** 	at hudson.Launcher$RemoteLauncher$ProcImpl.isAlive(Launcher.java:1150)
**12:45:39** 	at hudson.Launcher$RemoteLauncher$ProcImpl.join(Launcher.java:1142)
**12:45:39** 	at hudson.tasks.CommandInterpreter.join(CommandInterpreter.java:155)
**12:45:39** 	at hudson.tasks.CommandInterpreter.perform(CommandInterpreter.java:109)
**12:45:39** 	at hudson.tasks.CommandInterpreter.perform(CommandInterpreter.java:66)
**12:45:39** 	at hudson.tasks.BuildStepMonitor$1.perform(BuildStepMonitor.java:20)
**12:45:39** 	at hudson.model.AbstractBuild$AbstractBuildExecution.perform(AbstractBuild.java:741)
**12:45:39** 	at hudson.model.Build$BuildExecution.build(Build.java:206)
**12:45:39** 	at hudson.model.Build$BuildExecution.doRun(Build.java:163)
**12:45:39** 	at hudson.model.AbstractBuild$AbstractBuildExecution.run(AbstractBuild.java:504)
**12:45:39** 	at hudson.model.Run.execute(Run.java:1815)
**12:45:39** 	at hudson.model.FreeStyleBuild.run(FreeStyleBuild.java:43)
**12:45:39** 	at hudson.model.ResourceController.execute(ResourceController.java:97)
**12:45:39** 	at hudson.model.Executor.run(Executor.java:429)
**12:45:39** FATAL: Unable to delete script file /var/folders/_8/79jmzf2142z2xydc_01btlx00000gn/T/jenkins8980241727472490607.sh

New issue found!

New issue found!

Terms of Service

Privacy Policy

Cookie Policy