[Swift CI] Build Failure: 2. Swift Source Compatibility Suite (master) #806

Not it:

-Chris

In file included from /Users/buildnode/jenkins/workspace-private/swift-master-source-compat-suite/swift/lib/Migrator/Migrator.cpp:13:
In file included from /Users/buildnode/jenkins/workspace-private/swift-master-source-compat-suite/swift/include/swift/Frontend/Frontend.h:35:
In file included from /Users/buildnode/jenkins/workspace-private/swift-master-source-compat-suite/swift/include/swift/Parse/CodeCompletionCallbacks.h:17:
In file included from /Users/buildnode/jenkins/workspace-private/swift-master-source-compat-suite/swift/include/swift/Parse/Parser.h:34:
In file included from /Users/buildnode/jenkins/workspace-private/swift-master-source-compat-suite/swift/include/swift/Syntax/SyntaxParsingContext.h:17:
In file included from /Users/buildnode/jenkins/workspace-private/swift-master-source-compat-suite/swift/include/swift/Syntax/Syntax.h:26:
In file included from /Users/buildnode/jenkins/workspace-private/swift-master-source-compat-suite/swift/include/swift/Syntax/SyntaxData.h:43:
/Users/buildnode/jenkins/workspace-private/swift-master-source-compat-suite/swift/include/swift/Syntax/RawSyntax.h:33:10: fatal error: 'swift/Syntax/SyntaxKind.h' file not found
#include "swift/Syntax/SyntaxKind.h"
         ^~~~~~~~~~~~~~~~~~~~~~~~~~~
1 error generated.
ninja: build stopped: subcommand failed.
/Users/buildnode/jenkins/workspace-private/swift-master-source-compat-suite/swift/utils/build-script: fatal error: command terminated with a non-zero exit status 1, aborting
Traceback (most recent call last):
  File "./swift-source-compat-suite/run", line 242, in <module>
    sys.exit(main())
  File "./swift-source-compat-suite/run", line 38, in main
    build_swift_toolchain(workspace, args)
  File "./swift-source-compat-suite/run", line 238, in build_swift_toolchain
    common.check_execute(build_command, timeout=9999999)
  File "/Users/buildnode/jenkins/workspace/swift-master-source-compat-suite/swift-source-compat-suite/common.py", line 334, in check_execute
    raise ExecuteCommandFailure(command, returncode)

···

On Nov 26, 2017, at 5:26 PM, no-reply@swift.org wrote:

[FAILURE] swift-master-source-compat-suite [#806]

Build URL: https://ci.swift.org/job/swift-master-source-compat-suite/806/
Project: swift-master-source-compat-suite
Date of build: Sun, 26 Nov 2017 18:35:08 -0600
Build duration: 51 min

Changes

Commit 3f5790fb3724f499c6b6d4f6899440a9368bb79b by clattner:
Enhance MemberLookupResult's UnviableCandidates list, NFC.

edit: lib/Sema/CSDiag.cpp
edit: lib/Sema/CSSimplify.cpp
edit: lib/Sema/ConstraintSystem.h
edit: lib/Sema/CSGen.cpp