[Swift CI] Build Failure: 2. Swift Source Compatibility Suite (master) #332


(Michael Ilseman) #1

Are these hosts of failures due to the bots getting upgraded?

/Users/buildnode/jenkins/workspace-private/swift-master-source-compat-suite/swift/utils/build-script: fatal error: can't find CMake (please install CMake)

···

On May 16, 2017, at 10:37 PM, no-reply@swift.org wrote:

[FAILURE] swift-master-source-compat-suite [#332]

Build URL: https://ci.swift.org/job/swift-master-source-compat-suite/332/
Project: swift-master-source-compat-suite
Date of build: Tue, 16 May 2017 22:36:21 -0700
Build duration: 1 min 15 sec

Changes

Commit d0e4ba38b8ba14ed28f38f0c3f51fa05ebb5e6ec by Slava Pestov:
Serialization: Use nested type lookup table for cross-module references

edit: lib/Serialization/Serialization.cpp
add: test/Serialization/Inputs/multi-module-nested-type-2.swift
add: test/Serialization/multi-module-nested-type-extension.swift
edit: lib/Serialization/Deserialization.cpp
add: test/Serialization/Inputs/multi-module-nested-type-1.swift


(Mishal Shah) #2

This was due to system being upgraded.

Next builds are passing.

Build ↑
<https://ci.swift.org/job/swift-master-source-compat-suite/buildTimeTrend#> Duration
<https://ci.swift.org/job/swift-master-source-compat-suite/buildTimeTrend#> Agent
<https://ci.swift.org/job/swift-master-source-compat-suite/buildTimeTrend#>
  #340 <https://ci.swift.org/job/swift-master-source-compat-suite/340/> 55 min and counting macOS-37 <https://ci.swift.org/computer/macOS-37>
  #339 <https://ci.swift.org/job/swift-master-source-compat-suite/339/> 1 hr 22 min macOS-37 <https://ci.swift.org/computer/macOS-37>
  #338 <https://ci.swift.org/job/swift-master-source-compat-suite/338/> 1 hr 22 min macOS-37 <https://ci.swift.org/computer/macOS-37>
  #337 <https://ci.swift.org/job/swift-master-source-compat-suite/337/> 1 hr 22 min macOS-37 <https://ci.swift.org/computer/macOS-37>
  #336 <https://ci.swift.org/job/swift-master-source-compat-suite/336/> 1 hr 23 min macOS-37 <https://ci.swift.org/computer/macOS-37>
  #335 <https://ci.swift.org/job/swift-master-source-compat-suite/335/> 1 hr 4 min macOS-30 <https://ci.swift.org/computer/macOS-30>
  #334 <https://ci.swift.org/job/swift-master-source-compat-suite/334/> 1 hr 2 min macOS-33 <https://ci.swift.org/computer/macOS-33>
  #333 <https://ci.swift.org/job/swift-master-source-compat-suite/333/> 1 hr 3 min macOS-32 <https://ci.swift.org/computer/macOS-32>
  #332 <https://ci.swift.org/job/swift-master-source-compat-suite/332/> 1 min 15 sec macOS-37 <https://ci.swift.org/computer/macOS-37>

Thanks,
Mishal Shah

···

On May 17, 2017, at 9:05 AM, Michael Ilseman <milseman@apple.com> wrote:

Are these hosts of failures due to the bots getting upgraded?

/Users/buildnode/jenkins/workspace-private/swift-master-source-compat-suite/swift/utils/build-script: fatal error: can't find CMake (please install CMake)

On May 16, 2017, at 10:37 PM, no-reply@swift.org <mailto:no-reply@swift.org> wrote:

[FAILURE] swift-master-source-compat-suite [#332]

Build URL: https://ci.swift.org/job/swift-master-source-compat-suite/332/
Project: swift-master-source-compat-suite
Date of build: Tue, 16 May 2017 22:36:21 -0700
Build duration: 1 min 15 sec

Changes

Commit d0e4ba38b8ba14ed28f38f0c3f51fa05ebb5e6ec by Slava Pestov:
Serialization: Use nested type lookup table for cross-module references

edit: lib/Serialization/Serialization.cpp
add: test/Serialization/Inputs/multi-module-nested-type-2.swift
add: test/Serialization/multi-module-nested-type-extension.swift
edit: lib/Serialization/Deserialization.cpp
add: test/Serialization/Inputs/multi-module-nested-type-1.swift