[Swift CI] Build Failure: 2. Swift Source Compatibility Suite (master) #1386

Report

[FAILURE] swift-master-source-compat-suite [#1386]

Build URL:
https://ci.swift.org/job/swift-master-source-compat-suite/1386/
Project:
swift-master-source-compat-suite
Date of build:
Wed, 07 Mar 2018 14:08:23 -0600
Build duration:
4 hr 25 min

Changes

  • Commit 954db4bc227509b82617306a6a9bd6337d002719 by ghoare:
    [BatchMode] Disable fussy exec-arg-length-limit test on asan,

    • edit: test/Driver/batch_mode_overlong_argv.swift
  • Commit 4b05449c37ad6ed7f10df43b6d9b2c81054cb685 by pyaskevich:
    [GSB] Eliminate concrete potential archetypes by early substitution

    • edit: lib/Sema/TypeCheckGeneric.cpp
    • edit: test/SourceKit/DocSupport/doc_swift_module.swift.response
    • edit: lib/AST/GenericSignatureBuilder.cpp
    • edit: test/decl/typealias/protocol.swift
    • edit: include/swift/AST/GenericSignatureBuilder.h
  • Commit b52a94d78991a3b3b3b9c1b07824465d9fed8121 by klorentey:
    [test] Fix tests relying on specific hash values or Set/Dictionary

    • edit: test/Interpreter/SDK/equatable_hashable.swift
    • edit: test/stdlib/ReflectionHashing.swift
    • edit: test/Interpreter/SDK/Foundation_bridge.swift
    • edit: validation-test/stdlib/Set.swift
    • edit: test/Interpreter/repl.swift
    • edit: validation-test/stdlib/Dictionary.swift
  • Commit 7469783868676feb4550a087943504cb60712c77 by github:
    Revert “[stdlib] Add faster 32-bit and 64-bit binade, nextUp, ulp”

    • edit: stdlib/public/core/FloatingPointTypes.swift.gyb
  • Commit 2de30abb2f6d44237e41ddb156e6f89b9025df08 by github:
    [stdlib] Remove .gyb from two files that aren’t using it (#15031)

    • delete: stdlib/public/core/NewtypeWrapper.swift.gyb
    • delete: stdlib/public/core/StringRangeReplaceableCollection.swift.gyb
    • add: stdlib/public/core/StringRangeReplaceableCollection.swift
    • add: stdlib/public/core/NewtypeWrapper.swift
    • edit: stdlib/public/core/CMakeLists.txt
  • Commit 96c0083d0255b4d9eb5d39a1b4a48570529c4cae by github:
    [Driver] Provide executed command as an actual array (#15012)

    • edit: test/Driver/batch_mode_parseable_output.swift
    • edit: test/Driver/parseable_output.swift
    • edit: test/Driver/parseable_output_unicode.swift
    • edit: lib/Driver/ParseableOutput.cpp
    • edit: docs/DriverParseableOutput.rst
  • Commit 8990ed4f780a3689ee9ae634f62067dcc93e23da by atrick:
    Fix closure inlining after witness devirtualization.

    • edit: test/SILOptimizer/sil_combine_apply.sil
    • edit: lib/SILOptimizer/SILCombiner/SILCombiner.h
    • edit: test/SILOptimizer/sil_combine.sil
    • edit: lib/SILOptimizer/SILCombiner/SILCombinerApplyVisitors.cpp
 Assertion failed: (!CurCallee.getOrigFunctionType()->isNoEscape() && "Missing context?"), function setFromCallee, file /Users/buildnode/jenkins/workspace-private/swift-master-source-compat-suite/swift/lib/IRGen/GenCall.cpp, line 1924.
0 swift 0x00000001061e7f08 llvm::sys::PrintStackTrace(llvm::raw_ostream&) + 40
1 swift 0x00000001061e8596 SignalHandler(int) + 422
2 libsystem_platform.dylib 0x00007fff71d1df5a _sigtramp + 26
3 libsystem_platform.dylib 0x00007ffeed223928 _sigtramp + 2068863464
4 libsystem_c.dylib 0x00007fff71b48312 abort + 127
5 libsystem_c.dylib 0x00007fff71b10368 basename_r + 0
6 swift 0x0000000102a84b60 swift::irgen::CallEmission::setFromCallee() + 1456
7 swift 0x0000000102bca613 (anonymous namespace)::IRGenSILFunction::visitFullApplySite(swift::FullApplySite) + 1475
8 swift 0x0000000102bb259f (anonymous namespace)::IRGenSILFunction::emitSILFunction() + 6863
9 swift 0x0000000102bb056b swift::irgen::IRGenModule::emitSILFunction(swift::SILFunction*) + 1371
10 swift 0x0000000102aba085 swift::irgen::IRGenerator::emitGlobalTopLevel() + 485
11 swift 0x0000000102b8b7ed swift::performIRGeneration(swift::IRGenOptions&, swift::ModuleDecl*, std::__1::unique_ptr<swift::SILModule, std::__1::default_delete<swift::SILModule> >, llvm::StringRef, swift::PrimarySpecificPaths const&, llvm::LLVMContext&, llvm::ArrayRef<std::__1::basic_string<char, std::__1::char_traits<char>, std::__1::allocator<char> > >, llvm::GlobalVariable**) + 1549
12 swift 0x0000000102a2a0ff performCompile(swift::CompilerInstance&, swift::CompilerInvocation&, llvm::ArrayRef<char const*>, int&, swift::FrontendObserver*, swift::UnifiedStatsReporter*) + 15263
13 swift 0x0000000102a25586 swift::performFrontend(llvm::ArrayRef<char const*>, char const*, void*, swift::FrontendObserver*) + 3062
14 swift 0x00000001029db910 main + 2832
15 libdyld.dylib 0x00007fff71a9c115 start + 1
Stack dump:
0.	Program arguments: /Users/buildnode/jenkins/workspace-private/swift-master-source-compat-suite/build/compat_macos/install/toolchain/usr/bin/swift -frontend -c /Users/buildnode/jenkins/workspace-private/swift-master-source-compat-suite/project_cache/URBNJSONDecodableSPM/Sources/DecodableErrors.swift /Users/buildnode/jenkins/workspace-private/swift-master-source-compat-suite/project_cache/URBNJSONDecodableSPM/Sources/JSONDecodable.swift /Users/buildnode/jenkins/workspace-private/swift-master-source-compat-suite/project_cache/URBNJSONDecodableSPM/Sources/Operators.swift -target x86_64-apple-macosx10.10 -enable-objc-interop -sdk /Applications/Xcode-beta.app/Contents/Developer/Platforms/MacOSX.platform/Developer/SDKs/MacOSX10.13.sdk -I /Users/buildnode/jenkins/workspace-private/swift-master-source-compat-suite/project_cache/URBNJSONDecodableSPM/.build/x86_64-apple-macosx10.10/release -F /Applications/Xcode-beta.app/Contents/Developer/Platforms/MacOSX.platform/Developer/Library/Frameworks -module-cache-path /Users/buildnode/jenkins/workspace-private/swift-master-source-compat-suite/project_cache/URBNJSONDecodableSPM/.build/x86_64-apple-macosx10.10/release/ModuleCache -swift-version 3 -O -D SWIFT_PACKAGE -emit-module-doc-path /Users/buildnode/jenkins/workspace-private/swift-master-source-compat-suite/project_cache/URBNJSONDecodableSPM/.build/x86_64-apple-macosx10.10/release/URBNJSONDecodableSPM.swiftdoc -parse-as-library -module-name URBNJSONDecodableSPM -emit-module-path /Users/buildnode/jenkins/workspace-private/swift-master-source-compat-suite/project_cache/URBNJSONDecodableSPM/.build/x86_64-apple-macosx10.10/release/URBNJSONDecodableSPM.swiftmodule -emit-dependencies-path /Users/buildnode/jenkins/workspace-private/swift-master-source-compat-suite/project_cache/URBNJSONDecodableSPM/.build/x86_64-apple-macosx10.10/release/URBNJSONDecodableSPM.build/URBNJSONDecodableSPM.d -num-threads 4 -o /Users/buildnode/jenkins/workspace-private/swift-master-source-compat-suite/project_cache/URBNJSONDecodableSPM/.build/x86_64-apple-macosx10.10/release/URBNJSONDecodableSPM.build/DecodableErrors.swift.o -o /Users/buildnode/jenkins/workspace-private/swift-master-source-compat-suite/project_cache/URBNJSONDecodableSPM/.build/x86_64-apple-macosx10.10/release/URBNJSONDecodableSPM.build/JSONDecodable.swift.o -o /Users/buildnode/jenkins/workspace-private/swift-master-source-compat-suite/project_cache/URBNJSONDecodableSPM/.build/x86_64-apple-macosx10.10/release/URBNJSONDecodableSPM.build/Operators.swift.o 1.	While emitting IR SIL function "@$S20URBNJSONDecodableSPM2egoiyypyp_SaySSGtKF".
for '=>(_:_:)' at /Users/buildnode/jenkins/workspace-private/swift-master-source-compat-suite/project_cache/URBNJSONDecodableSPM/Sources/Operators.swift:67:8
<unknown>:0: error: unable to execute command: Abort trap: 6
<unknown>:0: error: compile command failed due to signal 6 (use -v to see invocation)