[Swift CI] Build Failure: 1. OSS - Swift ASAN - OS X (master) #803


(Joe Shajrawi) #1

Java exception in ASAN
FATAL: command execution failed
java.io.EOFException
<http://stacktrace.jenkins-ci.org/search?query=java.io.EOFException> at java.io.ObjectInputStream$PeekInputStream.readFully(ObjectInputStream.java:2335) <http://stacktrace.jenkins-ci.org/search/?query=java.io.ObjectInputStream$PeekInputStream.readFully&entity=method>
  at java.io.ObjectInputStream$BlockDataInputStream.readShort(ObjectInputStream.java:2804) <http://stacktrace.jenkins-ci.org/search/?query=java.io.ObjectInputStream$BlockDataInputStream.readShort&entity=method>
  at java.io.ObjectInputStream.readStreamHeader(ObjectInputStream.java:802) <http://stacktrace.jenkins-ci.org/search/?query=java.io.ObjectInputStream.readStreamHeader&entity=method>
  at java.io.ObjectInputStream.<init>(ObjectInputStream.java:299) <http://stacktrace.jenkins-ci.org/search/?query=java.io.ObjectInputStream.<init>&entity=method>
  at hudson.remoting.ObjectInputStreamEx.<init>(ObjectInputStreamEx.java:48) <http://stacktrace.jenkins-ci.org/search/?query=hudson.remoting.ObjectInputStreamEx.<init>&entity=method>
  at hudson.remoting.AbstractSynchronousByteArrayCommandTransport.read(AbstractSynchronousByteArrayCommandTransport.java:34) <http://stacktrace.jenkins-ci.org/search/?query=hudson.remoting.AbstractSynchronousByteArrayCommandTransport.read&entity=method>
  at hudson.remoting.SynchronousCommandTransport$ReaderThread.run(SynchronousCommandTransport.java:59) <http://stacktrace.jenkins-ci.org/search/?query=hudson.remoting.SynchronousCommandTransport$ReaderThread.run&entity=method>
Caused: java.io.IOException: Unexpected termination of the channel
  at hudson.remoting.SynchronousCommandTransport$ReaderThread.run(SynchronousCommandTransport.java:73)
Caused: java.io.IOException: Backing channel 'macOS-19' is disconnected.
  at hudson.remoting.RemoteInvocationHandler.channelOrFail(RemoteInvocationHandler.java:192)
  at hudson.remoting.RemoteInvocationHandler.invoke(RemoteInvocationHandler.java:257)
  at com.sun.proxy.$Proxy91.isAlive(Unknown Source)
  at hudson.Launcher$RemoteLauncher$ProcImpl.isAlive(Launcher.java:1043)
  at hudson.Launcher$RemoteLauncher$ProcImpl.join(Launcher.java:1035)
  at hudson.tasks.CommandInterpreter.join(CommandInterpreter.java:155)
  at hudson.tasks.CommandInterpreter.perform(CommandInterpreter.java:109)
  at hudson.tasks.CommandInterpreter.perform(CommandInterpreter.java:66)
  at hudson.tasks.BuildStepMonitor$1.perform(BuildStepMonitor.java:20)
  at hudson.model.AbstractBuild$AbstractBuildExecution.perform(AbstractBuild.java:779)
  at hudson.model.Build$BuildExecution.build(Build.java:206)
  at hudson.model.Build$BuildExecution.doRun(Build.java:163)
  at hudson.model.AbstractBuild$AbstractBuildExecution.run(AbstractBuild.java:534)
  at hudson.model.Run.execute(Run.java:1728)
  at hudson.model.FreeStyleBuild.run(FreeStyleBuild.java:43)
  at hudson.model.ResourceController.execute(ResourceController.java:98)
  at hudson.model.Executor.run(Executor.java:405)
Build step 'Execute shell' marked build as failure
[xUnit] [INFO] - Starting to record.
[xUnit] [INFO] - Processing JUnit
ERROR: Build step failed with exception
java.lang.NullPointerException
<http://stacktrace.jenkins-ci.org/search?query=java.lang.NullPointerException> at org.jenkinsci.plugins.xunit.XUnitProcessor.performTests(XUnitProcessor.java:145) <http://stacktrace.jenkins-ci.org/search/?query=org.jenkinsci.plugins.xunit.XUnitProcessor.performTests&entity=method>
  at org.jenkinsci.plugins.xunit.XUnitProcessor.performXUnit(XUnitProcessor.java:88) <http://stacktrace.jenkins-ci.org/search/?query=org.jenkinsci.plugins.xunit.XUnitProcessor.performXUnit&entity=method>
  at org.jenkinsci.plugins.xunit.XUnitPublisher.perform(XUnitPublisher.java:142) <http://stacktrace.jenkins-ci.org/search/?query=org.jenkinsci.plugins.xunit.XUnitPublisher.perform&entity=method>
  at org.jenkinsci.plugins.xunit.XUnitPublisher.perform(XUnitPublisher.java:134) <http://stacktrace.jenkins-ci.org/search/?query=org.jenkinsci.plugins.xunit.XUnitPublisher.perform&entity=method>
  at hudson.tasks.BuildStepMonitor$1.perform(BuildStepMonitor.java:20) <http://stacktrace.jenkins-ci.org/search/?query=hudson.tasks.BuildStepMonitor$1.perform&entity=method>
  at hudson.model.AbstractBuild$AbstractBuildExecution.perform(AbstractBuild.java:779) <http://stacktrace.jenkins-ci.org/search/?query=hudson.model.AbstractBuild$AbstractBuildExecution.perform&entity=method>
  at hudson.model.AbstractBuild$AbstractBuildExecution.performAllBuildSteps(AbstractBuild.java:720) <http://stacktrace.jenkins-ci.org/search/?query=hudson.model.AbstractBuild$AbstractBuildExecution.performAllBuildSteps&entity=method>
  at hudson.model.Build$BuildExecution.post2(Build.java:186) <http://stacktrace.jenkins-ci.org/search/?query=hudson.model.Build$BuildExecution.post2&entity=method>
  at hudson.model.AbstractBuild$AbstractBuildExecution.post(AbstractBuild.java:665) <http://stacktrace.jenkins-ci.org/search/?query=hudson.model.AbstractBuild$AbstractBuildExecution.post&entity=method>
  at hudson.model.Run.execute(Run.java:1753) <http://stacktrace.jenkins-ci.org/search/?query=hudson.model.Run.execute&entity=method>
  at hudson.model.FreeStyleBuild.run(FreeStyleBuild.java:43) <http://stacktrace.jenkins-ci.org/search/?query=hudson.model.FreeStyleBuild.run&entity=method>
  at hudson.model.ResourceController.execute(ResourceController.java:98) <http://stacktrace.jenkins-ci.org/search/?query=hudson.model.ResourceController.execute&entity=method>
  at hudson.model.Executor.run(Executor.java:405) <http://stacktrace.jenkins-ci.org/search/?query=hudson.model.Executor.run&entity=method>

Regards,
—Joe |  | :e-mail: shajrawi@apple.com | :iphone:(+1) 408-930-5203

···

On May 25, 2017, at 6:13 AM, no-reply@swift.org wrote:

[FAILURE] oss-swift-incremental-ASAN-RA-osx [#803]

Build URL: https://ci.swift.org/job/oss-swift-incremental-ASAN-RA-osx/803/
Project: oss-swift-incremental-ASAN-RA-osx
Date of build: Thu, 25 May 2017 04:26:20 -0700
Build duration: 1 hr 46 min

Changes

Commit e867bfca1a093353e3176f875081ec29f1c9017b by Tom Stellard:
Merging r302416:

add: test/MC/ARM/ltorg-range.s
edit: include/llvm/MC/ConstantPools.h
edit: lib/MC/ConstantPools.cpp
edit: lib/Target/ARM/MCTargetDesc/ARMTargetStreamer.cpp

Commit cc461ef2a2c9046458383b219f2b6836dfc3e0f4 by Tom Stellard:
Merging r303679:

edit: test/CodeGen/ARM/constantpool-promote-ldrh.ll
edit: lib/Target/ARM/ARMISelLowering.cpp
edit: test/CodeGen/ARM/constantpool-promote-dbg.ll
edit: test/CodeGen/ARM/constantpool-promote.ll

Commit 24ddb9cde6b4e7f97030872eafcab54c481882a3 by Ankit Aggarwal:
[PackageGraph] Fix prerelease resolution behaviour

edit: Tests/FunctionalTests/DependencyResolutionTests.swift
edit: Tests/PackageGraphTests/DependencyResolverTests.swift
edit: Tests/UtilityTests/VersionTests.swift
edit: Sources/PackageGraph/DependencyResolver.swift
edit: Tests/FunctionalTests/MiscellaneousTests.swift
edit: Tests/FunctionalTests/ValidLayoutTests.swift
edit: Tests/PackageGraphTests/RepositoryPackageContainerProviderTests.swift
edit: Sources/TestSupport/misc.swift
edit: Sources/Utility/Version.swift