[Swift CI] Build Failure: 1. OSS - Swift ASAN - OS X (master) #1497


[FAILURE] oss-swift-incremental-ASAN-RA-osx [#1497]

Build URL:
Date of build:
Thu, 12 Apr 2018 22:26:53 -0500
Build duration:
1 hr 2 min

Identified problems:

  • Jenkins Error: This build failed because of a Jenkins Error; typically a Java exception.


  • Commit 0a4204e99ff5ed1622e2f7fbd6c64773f058b7c0 by nhawes:
    [Driver] Add -driver-filelist-threshold to set the number of inputs

    • edit: include/swift/AST/DiagnosticsDriver.def
    • edit: test/Driver/driver-compile.swift
    • edit: test/Driver/batch_mode_with_supplementary_filelist_unicode.swift
    • edit: test/Driver/batch_mode_with_supplementary_filelist_execution.swift
    • edit: test/Driver/batch_mode_with_supplementary_filelist.swift
    • edit: include/swift/Driver/ToolChain.h
    • edit: lib/Driver/Compilation.cpp
    • edit: include/swift/Driver/Compilation.h
    • add: test/SourceKit/Misc/handle-filelists.swift
    • edit: lib/Driver/ToolChains.cpp
    • edit: test/Driver/filelists.swift
    • add: test/Driver/filelist-threshold.swift
    • edit: lib/Driver/FrontendUtil.cpp
    • edit: test/Driver/linker.swift
    • edit: test/Driver/merge-module.swift
    • edit: include/swift/Option/Options.td
    • edit: lib/Driver/Driver.cpp
    • edit: test/Driver/batch_mode_with_pch.swift
  • Commit 4dd3318ca28ef7420a487b47cb9695b28026d5f3 by blangmuir:
    Fix filelist-threshold test

    • edit: test/Driver/filelist-threshold.swift
  • Commit 2ca8fe7aa15022363f9a8d8bf8da01917ccb82fb by blangmuir:
    Update option help text per review comment

    • edit: include/swift/Option/Options.td
  • Commit 03a30782e062810645acf82e496da6be3d4ea8a2 by github:
    Foundation overlay: include (#15911)

    • edit: stdlib/public/SwiftShims/FoundationOverlayShims.h
  • Commit bb567886d8f42c2d5607df7aacaaf1ed3f986ef6 by github:
    [Coverage] Disable forced emission for unmapped decls (#15909)

    • edit: lib/SIL/SILProfiler.cpp
    • edit: test/SILGen/coverage_force_emission.swift
    • edit: include/swift/SIL/SILProfiler.h
    • edit: lib/SILGen/SILGen.cpp

Non-deterministic failure? Doesn't seem related to this change and the next build passed.

<unknown>:0: error: error opening '/var/folders/gy/4s6_z62x7n33w9x2mgf0stq80000gn/T/lit_tmp_tFzdaX/main-4486fe.swiftmodule' for output: No such file or directory <unknown>:0: error: merge-module command failed with exit code 1 (use -v to see invocation)