[Swift CI] Build Failure: 0. OSS - Swift Incremental RA - Ubuntu14.04 (master) #7030

Report

[FAILURE] oss-swift-incremental-RA-linux-ubuntu-14_04 [#7030]

Build URL:
https://ci.swift.org/job/oss-swift-incremental-RA-linux-ubuntu-14_04/7030/
Project:
oss-swift-incremental-RA-linux-ubuntu-14_04
Date of build:
Thu, 21 Feb 2019 21:40:41 -0600
Build duration:
1 hr 32 min

Changes

  • Commit 91a405a3dcf15d27cebd93e93a715a2f1c17849a by tomi.lahtinen:
    Fixed typo in comments

    • edit: lib/Demangling/OldDemangler.cpp
  • Commit 8c77e08fad852f0ff5c9b1d3ac664a468fa32f10 by github:
    Clarify the rule for leading trivia

    • edit: lib/Syntax/README.md
  • Commit e5e9dc6c057d07f0f3567c47015fea3dff5bf7ff by nhawes:
    [sourcekitd] Expose the 'implicit' symbol role in the 'index' request

    • edit: test/SourceKit/Indexing/index_operators.swift.response
    • edit: test/SourceKit/Indexing/index_big_array.swift.response
    • edit: utils/gyb_sourcekit_support/UIDs.py
    • edit: tools/SourceKit/lib/SwiftLang/SwiftIndexing.cpp
    • edit: test/SourceKit/Indexing/Inputs/test_module.index.response
    • edit: test/SourceKit/Indexing/index_bad_modulename.swift.response
    • edit: test/SourceKit/Indexing/index_forbid_typecheck.swift.response
    • edit: tools/SourceKit/tools/sourcekitd/lib/API/Requests.cpp
    • edit: test/SourceKit/Indexing/sr_3815.swift.response
    • edit: tools/SourceKit/include/SourceKit/Core/LangSupport.h
    • edit: test/SourceKit/Indexing/Inputs/implicit-vis/a.index.response
    • edit: test/SourceKit/Indexing/index_is_test_candidate.swift.response
    • edit: test/SourceKit/Indexing/index_is_test_candidate_objc.swift.response
    • edit: test/SourceKit/Indexing/Inputs/implicit-vis/b.index.response
    • edit: test/SourceKit/Indexing/index_constructors.swift.response
    • edit: test/SourceKit/Indexing/index_enum_case.swift.response
    • edit: test/SourceKit/Indexing/rdar_21602898.swift.response
  • Commit 6d19f7e0f4927b7ea8e92b85901e27e2082fee37 by spestov:
    Sema: Fix inconsistent behavior with SE-0110-related compatibility hack

    • edit: lib/Sema/CSSimplify.cpp
    • edit: test/Constraints/tuple_arguments.swift
    • edit: test/Compatibility/tuple_arguments_4.swift
  • Commit 30994389f20926f1e26e096a05d750b30a17781c by atrick:
    Disable merging of read/modify exclusivity access markers.

    • edit: lib/SILOptimizer/Transforms/AccessEnforcementOpts.cpp
    • edit: test/SILOptimizer/merge_exclusivity.swift
    • edit: test/SILOptimizer/access_enforcement_opts.sil
  • Commit 82f8d3f2e9a9553b0ce00a86540e89a123be5916 by spestov:
    RemoteAST: Try to fix a use-after-free in swift-remoteast-test

    • edit: tools/swift-remoteast-test/swift-remoteast-test.cpp
    • edit: test/RemoteAST/existentials_objc.swift
    • edit: test/RemoteAST/objc_classes.swift
    • edit: test/RemoteAST/existentials.swift
    • edit: test/RemoteAST/member_offsets.swift
    • edit: test/RemoteAST/nominal_types.swift
    • edit: test/RemoteAST/foreign_types.swift
    • edit: test/RemoteAST/structural_types.swift
    • edit: test/RemoteAST/extensions.swift
  • Commit f58155924ccd45fa17d6e967325cdad47ff56bbf by compnerd:
    stdlib: repair the Windows build

    • edit: stdlib/public/core/CMakeLists.txt
  • Commit aa5f75c30e98e7096c162d6e1aaf72aaac6cbc5c by si:
    SR-6531: FileManager copyItem() does not preserve permissions

    • edit: Foundation/FileManager.swift
    • edit: TestFoundation/TestFileManager.swift
  • Commit a16c18c4bb2b12772d2717ee2f22872e24e0baf5 by si:
    SR-6531: Check the file copy worked in the tests

    • edit: TestFoundation/TestFileManager.swift
  • Commit 7240ee29f5219694f67d7907a658906fea3c7575 by david_smith:
    Speedup for NSString -getCharacters:range:

    • edit: Foundation.xcodeproj/xcshareddata/xcschemes/SwiftFoundation.xcscheme
    • edit: Foundation/NSString.swift

New issue found!

/home/buildnode/jenkins/workspace/oss-swift-incremental-RA-linux-ubuntu-14_04/swift-corelibs-foundation/TestFoundation/TestURLSession.swift:160: error: TestURLSession.test_dataTaskWithHttpInputStream : XCTAssertNotNil failed -
**07:05:41** /home/buildnode/jenkins/workspace/oss-swift-incremental-RA-linux-ubuntu-14_04/swift-corelibs-foundation/TestFoundation/TestURLSession.swift:161: error: TestURLSession.test_dataTaskWithHttpInputStream : XCTAssertNotNil failed - **07:05:41** /home/buildnode/jenkins/workspace/oss-swift-incremental-RA-linux-ubuntu-14_04/swift-corelibs-foundation/TestFoundation/TestURLSession.swift:162: error: TestURLSession.test_dataTaskWithHttpInputStream : XCTAssertNil failed: "URLError(_nsError: Recv failure: Connection reset by peer)" - **07:05:41** /home/buildnode/jenkins/workspace/oss-swift-incremental-RA-linux-ubuntu-14_04/swift-corelibs-foundation/TestFoundation/TestURLSession.swift:166: error: TestURLSession.test_dataTaskWithHttpInputStream : failed - response (nil) invalid
**07:05:41** Test Case 'TestURLSession.test_dataTaskWithHttpInputStream' failed (0.005 seconds)
Terms of Service

Privacy Policy

Cookie Policy