[Swift CI] Build Failure: 0. OSS - Swift Incremental RA - Ubuntu 16.10 (swift 4.0) #901


(Mishal Shah) #1

Test Case 'TestNSTimer.test_timerRepeats' started at 2017-06-27 13:34:22.178
<>TestFoundation/TestNSTimer.swift:62: error: TestNSTimer.test_timerRepeats : XCTAssertEqual failed: ("1498588462.49172") is not equal to ("1498588462.47838") +/- ("0.01") -
Test Case 'TestNSTimer.test_timerRepeats' failed (0.4 seconds)

Thanks,
Mishal Shah

···

On Jun 27, 2017, at 11:35 AM, no-reply@swift.org wrote:

[FAILURE] oss-swift-4.0-incremental-RA-linux-ubuntu-16_10 [#901]

Build URL: https://ci.swift.org/job/oss-swift-4.0-incremental-RA-linux-ubuntu-16_10/901/
Project: oss-swift-4.0-incremental-RA-linux-ubuntu-16_10
Date of build: Tue, 27 Jun 2017 11:03:11 -0700
Build duration: 31 min
Identified problems:

Compile Error: This build failed because of a compile error. Below is a list of all errors in the build log:
Indication 1 <https://ci.swift.org//job/oss-swift-4.0-incremental-RA-linux-ubuntu-16_10/901/consoleFull#1804754728ee1a197b-acac-4b17-83cf-a53b95139a76>
Tests:

Name: Swift(linux-x86_64)
Failed: 0 test(s), Passed: 9535 test(s), Total: 9535 test(s)
Name: Swift-Unit
Failed: 0 test(s), Passed: 433 test(s), Total: 433 test(s)

Changes

Commit 3c4469ba449d59c4096d0c45050bb2a29ab0b1a8 by Pavel Yaskevich:
[QoI] Improve contextual error diagnostics related to calls

edit: lib/Sema/CSDiag.cpp
edit: lib/Sema/TypeCheckConstraints.cpp
edit: test/Constraints/array_literal.swift
edit: test/Generics/deduction.swift
edit: test/Constraints/fixes.swift
edit: test/Serialization/Recovery/typedefs.swift
edit: test/Constraints/diagnostics.swift

Commit 597804f8a5c82fdf804f94702d75c1aa00a494a3 by saiHemak:
Fix for URLSession redirect does not inherit request timeout

edit: TestFoundation/TestNSURLSession.swift
edit: Foundation/NSURLSession/http/HTTPURLProtocol.swift
edit: Foundation/NSURLSession/http/EasyHandle.swift


(Philippe Hausler) #2

Looks like our tolerance is too tight there. We should relax that so that heavy CI load does not muck with it too hard.

···

On Jun 27, 2017, at 11:39 AM, Mishal Shah via swift-dev <swift-dev@swift.org> wrote:

Test Case 'TestNSTimer.test_timerRepeats' started at 2017-06-27 13:34:22.178
<>TestFoundation/TestNSTimer.swift:62: error: TestNSTimer.test_timerRepeats : XCTAssertEqual failed: ("1498588462.49172") is not equal to ("1498588462.47838") +/- ("0.01") -
Test Case 'TestNSTimer.test_timerRepeats' failed (0.4 seconds)

Thanks,
Mishal Shah

On Jun 27, 2017, at 11:35 AM, no-reply@swift.org <mailto:no-reply@swift.org> wrote:

[FAILURE] oss-swift-4.0-incremental-RA-linux-ubuntu-16_10 [#901]

Build URL: https://ci.swift.org/job/oss-swift-4.0-incremental-RA-linux-ubuntu-16_10/901/
Project: oss-swift-4.0-incremental-RA-linux-ubuntu-16_10
Date of build: Tue, 27 Jun 2017 11:03:11 -0700
Build duration: 31 min
Identified problems:

Compile Error: This build failed because of a compile error. Below is a list of all errors in the build log:
Indication 1 <https://ci.swift.org//job/oss-swift-4.0-incremental-RA-linux-ubuntu-16_10/901/consoleFull#1804754728ee1a197b-acac-4b17-83cf-a53b95139a76>
Tests:

Name: Swift(linux-x86_64)
Failed: 0 test(s), Passed: 9535 test(s), Total: 9535 test(s)
Name: Swift-Unit
Failed: 0 test(s), Passed: 433 test(s), Total: 433 test(s)

Changes

Commit 3c4469ba449d59c4096d0c45050bb2a29ab0b1a8 by Pavel Yaskevich:
[QoI] Improve contextual error diagnostics related to calls

edit: lib/Sema/CSDiag.cpp
edit: lib/Sema/TypeCheckConstraints.cpp
edit: test/Constraints/array_literal.swift
edit: test/Generics/deduction.swift
edit: test/Constraints/fixes.swift
edit: test/Serialization/Recovery/typedefs.swift
edit: test/Constraints/diagnostics.swift

Commit 597804f8a5c82fdf804f94702d75c1aa00a494a3 by saiHemak:
Fix for URLSession redirect does not inherit request timeout

edit: TestFoundation/TestNSURLSession.swift
edit: Foundation/NSURLSession/http/HTTPURLProtocol.swift
edit: Foundation/NSURLSession/http/EasyHandle.swift

_______________________________________________
swift-dev mailing list
swift-dev@swift.org
https://lists.swift.org/mailman/listinfo/swift-dev