[Swift CI] Build Failure: 0. OSS - Swift Incremental RA - Ubuntu 16.10 (swift 4.0) #74


(Erik Eckstein) #1

Hi Ankit,

this timed out in the swiftpm tests.

Can your changes caused this?

Can you please check?

Thanks,
Erik

···

On Apr 17, 2017, at 3:51 PM, no-reply@swift.org wrote:

[FAILURE] oss-swift-4.0-incremental-RA-linux-ubuntu-16_10 [#74]

Build URL: https://ci.swift.org/job/oss-swift-4.0-incremental-RA-linux-ubuntu-16_10/74/
Project: oss-swift-4.0-incremental-RA-linux-ubuntu-16_10
Date of build: Mon, 17 Apr 2017 13:32:27 -0700
Build duration: 2 hr 19 min
Identified problems:

Timeout: This build was marked as FAIL because it timed out.
Indication 1 <https://ci.swift.org//job/oss-swift-4.0-incremental-RA-linux-ubuntu-16_10/74/consoleFull#89513194756633f0f-8823-4f82-9a4a-0c0d97ce7760>
Tests:

Name: Swift(linux-x86_64)
Failed: 0 test(s), Passed: 9151 test(s), Total: 9151 test(s)
Name: Swift-Unit
Failed: 0 test(s), Passed: 416 test(s), Total: 416 test(s)

Changes

Commit 1ba2af8393d92a8d74ce112562d7023e188bb787 by Bruno Cardoso Lopes:
PR32280: Do not crash on nested initializers.

edit: test/Sema/designated-initializers.c
edit: lib/Sema/SemaInit.cpp

Commit 326b26f206478c70a14a25c06a1517f233616931 by Ankit Aggarwal:
[Workspace] Make non-editable checkouts immutable

edit: Sources/Workspace/Workspace.swift
edit: Tests/WorkspaceTests/WorkspaceTests.swift
edit: Tests/FunctionalTests/MiscellaneousTests.swift


(Erik Eckstein) #2

Never mind, the following build is okay again.

···

On Apr 17, 2017, at 4:15 PM, Erik Eckstein <eeckstein@apple.com> wrote:

Hi Ankit,

this timed out in the swiftpm tests.

Can your changes caused this?

Can you please check?

Thanks,
Erik

On Apr 17, 2017, at 3:51 PM, no-reply@swift.org <mailto:no-reply@swift.org> wrote:

[FAILURE] oss-swift-4.0-incremental-RA-linux-ubuntu-16_10 [#74]

Build URL: https://ci.swift.org/job/oss-swift-4.0-incremental-RA-linux-ubuntu-16_10/74/
Project: oss-swift-4.0-incremental-RA-linux-ubuntu-16_10
Date of build: Mon, 17 Apr 2017 13:32:27 -0700
Build duration: 2 hr 19 min
Identified problems:

Timeout: This build was marked as FAIL because it timed out.
Indication 1 <https://ci.swift.org//job/oss-swift-4.0-incremental-RA-linux-ubuntu-16_10/74/consoleFull#89513194756633f0f-8823-4f82-9a4a-0c0d97ce7760>
Tests:

Name: Swift(linux-x86_64)
Failed: 0 test(s), Passed: 9151 test(s), Total: 9151 test(s)
Name: Swift-Unit
Failed: 0 test(s), Passed: 416 test(s), Total: 416 test(s)

Changes

Commit 1ba2af8393d92a8d74ce112562d7023e188bb787 by Bruno Cardoso Lopes:
PR32280: Do not crash on nested initializers.

edit: test/Sema/designated-initializers.c
edit: lib/Sema/SemaInit.cpp

Commit 326b26f206478c70a14a25c06a1517f233616931 by Ankit Aggarwal:
[Workspace] Make non-editable checkouts immutable

edit: Sources/Workspace/Workspace.swift
edit: Tests/WorkspaceTests/WorkspaceTests.swift
edit: Tests/FunctionalTests/MiscellaneousTests.swift


(Ankit Aggarwal) #3

Hi Ankit,

this timed out in the swiftpm tests.

Can your changes caused this?

No, but I think I have seen similar timeout before. It might be due to some test acting weird, I'll investigate.

···

On 18-Apr-2017, at 4:45 AM, Erik Eckstein <eeckstein@apple.com> wrote:

Can you please check?

Thanks,
Erik

On Apr 17, 2017, at 3:51 PM, no-reply@swift.org <mailto:no-reply@swift.org> wrote:

[FAILURE] oss-swift-4.0-incremental-RA-linux-ubuntu-16_10 [#74]

Build URL: https://ci.swift.org/job/oss-swift-4.0-incremental-RA-linux-ubuntu-16_10/74/
Project: oss-swift-4.0-incremental-RA-linux-ubuntu-16_10
Date of build: Mon, 17 Apr 2017 13:32:27 -0700
Build duration: 2 hr 19 min
Identified problems:

Timeout: This build was marked as FAIL because it timed out.
Indication 1 <https://ci.swift.org//job/oss-swift-4.0-incremental-RA-linux-ubuntu-16_10/74/consoleFull#89513194756633f0f-8823-4f82-9a4a-0c0d97ce7760>
Tests:

Name: Swift(linux-x86_64)
Failed: 0 test(s), Passed: 9151 test(s), Total: 9151 test(s)
Name: Swift-Unit
Failed: 0 test(s), Passed: 416 test(s), Total: 416 test(s)

Changes

Commit 1ba2af8393d92a8d74ce112562d7023e188bb787 by Bruno Cardoso Lopes:
PR32280: Do not crash on nested initializers.

edit: test/Sema/designated-initializers.c
edit: lib/Sema/SemaInit.cpp

Commit 326b26f206478c70a14a25c06a1517f233616931 by Ankit Aggarwal:
[Workspace] Make non-editable checkouts immutable

edit: Sources/Workspace/Workspace.swift
edit: Tests/WorkspaceTests/WorkspaceTests.swift
edit: Tests/FunctionalTests/MiscellaneousTests.swift