[Swift CI] Build Failure: 0. OSS - Swift Incremental RA - Ubuntu 16.10 (master-llvm-swift5-transition) #40

It looks like one of the tests in foundation got stuck again, I’ve seen that happen multiple times already with random changes:

Test Case 'TestNSLock.test_threadsAndLocks' started at 2018-01-12 22:10:05.848
<>Build timed out (after 45 minutes). Marking the build as failed.
Build was aborted

···

On Jan 12, 2018, at 2:55 PM, swift-ci@swift.org wrote:

[FAILURE] oss-swift-master-llvm-swift5-transition-incremental-RA-linux-ubuntu-16_10 [#40]

Build URL: https://ci.swift.org/job/oss-swift-master-llvm-swift5-transition-incremental-RA-linux-ubuntu-16_10/40/
Project: oss-swift-master-llvm-swift5-transition-incremental-RA-linux-ubuntu-16_10
Date of build: Fri, 12 Jan 2018 15:20:51 -0600
Build duration: 1 hr 34 min
Identified problems:

Timeout: This build was marked as FAIL because it timed out.
Indication 1 <https://ci.swift.org//job/oss-swift-master-llvm-swift5-transition-incremental-RA-linux-ubuntu-16_10/40/consoleFull#89513194797673623-2881-452e-8a87-fc2a90be9a24>
Tests:

Name: Swift(linux-x86_64)
Failed: 0 test(s), Passed: 10174 test(s), Total: 10174 test(s)
Name: Swift-Unit
Failed: 0 test(s), Passed: 506 test(s), Total: 506 test(s)

Changes

Commit 5c33809660f0300a753d1833e52f09e7b0469d73 by pyaskevich:
[AST] NFC: Add ParameterList::getType accessor which supports callback

edit: include/swift/AST/ParameterList.h
edit: lib/AST/Parameter.cpp

Commit 3384ea823b73e1e73b52d554955f94ddc6c5108b by blangmuir:
[test] Disable cursor_no_cancel test that crashes occassionaly in CI

edit: test/SourceKit/CursorInfo/cursor_no_cancel.swift

Commit 79c8695c5b38c80cacf7df3b14f1db3349a09ee5 by blangmuir:
[test] Disable SwiftSyntax/VisitorTest that fails occassionally in CI

edit: test/SwiftSyntax/VisitorTest.swift

+ Pierre

Can we xfail/disable this test?

···

On Jan 12, 2018, at 3:13 PM, Pavel Yaskevich <pyaskevich@apple.com> wrote:

It looks like one of the tests in foundation got stuck again, I’ve seen that happen multiple times already with random changes:

Test Case 'TestNSLock.test_threadsAndLocks' started at 2018-01-12 22:10:05.848
<>Build timed out (after 45 minutes). Marking the build as failed.
Build was aborted

On Jan 12, 2018, at 2:55 PM, swift-ci@swift.org <mailto:swift-ci@swift.org> wrote:

[FAILURE] oss-swift-master-llvm-swift5-transition-incremental-RA-linux-ubuntu-16_10 [#40]

Build URL: https://ci.swift.org/job/oss-swift-master-llvm-swift5-transition-incremental-RA-linux-ubuntu-16_10/40/
Project: oss-swift-master-llvm-swift5-transition-incremental-RA-linux-ubuntu-16_10
Date of build: Fri, 12 Jan 2018 15:20:51 -0600
Build duration: 1 hr 34 min
Identified problems:

Timeout: This build was marked as FAIL because it timed out.
Indication 1 <https://ci.swift.org//job/oss-swift-master-llvm-swift5-transition-incremental-RA-linux-ubuntu-16_10/40/consoleFull#89513194797673623-2881-452e-8a87-fc2a90be9a24>
Tests:

Name: Swift(linux-x86_64)
Failed: 0 test(s), Passed: 10174 test(s), Total: 10174 test(s)
Name: Swift-Unit
Failed: 0 test(s), Passed: 506 test(s), Total: 506 test(s)

Changes

Commit 5c33809660f0300a753d1833e52f09e7b0469d73 by pyaskevich:
[AST] NFC: Add ParameterList::getType accessor which supports callback

edit: include/swift/AST/ParameterList.h
edit: lib/AST/Parameter.cpp

Commit 3384ea823b73e1e73b52d554955f94ddc6c5108b by blangmuir:
[test] Disable cursor_no_cancel test that crashes occassionaly in CI

edit: test/SourceKit/CursorInfo/cursor_no_cancel.swift

Commit 79c8695c5b38c80cacf7df3b14f1db3349a09ee5 by blangmuir:
[test] Disable SwiftSyntax/VisitorTest that fails occassionally in CI

edit: test/SwiftSyntax/VisitorTest.swift

Oops, I meant to do +Philippe, sorry Pierre.

···

On Jan 12, 2018, at 3:37 PM, Ben Langmuir <blangmuir@apple.com> wrote:

+ Pierre

Can we xfail/disable this test?

On Jan 12, 2018, at 3:13 PM, Pavel Yaskevich <pyaskevich@apple.com <mailto:pyaskevich@apple.com>> wrote:

It looks like one of the tests in foundation got stuck again, I’ve seen that happen multiple times already with random changes:

Test Case 'TestNSLock.test_threadsAndLocks' started at 2018-01-12 22:10:05.848
<>Build timed out (after 45 minutes). Marking the build as failed.
Build was aborted

On Jan 12, 2018, at 2:55 PM, swift-ci@swift.org <mailto:swift-ci@swift.org> wrote:

[FAILURE] oss-swift-master-llvm-swift5-transition-incremental-RA-linux-ubuntu-16_10 [#40]

Build URL: https://ci.swift.org/job/oss-swift-master-llvm-swift5-transition-incremental-RA-linux-ubuntu-16_10/40/
Project: oss-swift-master-llvm-swift5-transition-incremental-RA-linux-ubuntu-16_10
Date of build: Fri, 12 Jan 2018 15:20:51 -0600
Build duration: 1 hr 34 min
Identified problems:

Timeout: This build was marked as FAIL because it timed out.
Indication 1 <https://ci.swift.org//job/oss-swift-master-llvm-swift5-transition-incremental-RA-linux-ubuntu-16_10/40/consoleFull#89513194797673623-2881-452e-8a87-fc2a90be9a24>
Tests:

Name: Swift(linux-x86_64)
Failed: 0 test(s), Passed: 10174 test(s), Total: 10174 test(s)
Name: Swift-Unit
Failed: 0 test(s), Passed: 506 test(s), Total: 506 test(s)

Changes

Commit 5c33809660f0300a753d1833e52f09e7b0469d73 by pyaskevich:
[AST] NFC: Add ParameterList::getType accessor which supports callback

edit: include/swift/AST/ParameterList.h
edit: lib/AST/Parameter.cpp

Commit 3384ea823b73e1e73b52d554955f94ddc6c5108b by blangmuir:
[test] Disable cursor_no_cancel test that crashes occassionaly in CI

edit: test/SourceKit/CursorInfo/cursor_no_cancel.swift

Commit 79c8695c5b38c80cacf7df3b14f1db3349a09ee5 by blangmuir:
[test] Disable SwiftSyntax/VisitorTest that fails occassionally in CI

edit: test/SwiftSyntax/VisitorTest.swift