[Swift CI] Build Failure: 0. OSS - Swift Incremental RA - Ubuntu 16.10 (master) #4985

Ian, I’m not sure why PR testing didn’t report this failure (is there a PR?). Would you be able to revert to unblock PR testing until this is fixed?

Test Case 'TestNotificationCenter.test_postNotification' started at 2017-08-02 22:33:02.555
/home/buildnode/jenkins/workspace/oss-swift-incremental-RA-linux-ubuntu-16_10/swift/utils/build-script-impl: line 261: 36420 Segmentation fault "$@"
/home/buildnode/jenkins/workspace/oss-swift-incremental-RA-linux-ubuntu-16_10/swift/utils/build-script: fatal error: command terminated with a non-zero exit status 139, aborting
/home/buildnode/jenkins/workspace/oss-swift-incremental-RA-linux-ubuntu-16_10/swift/utils/build-script: fatal error: command terminated with a non-zero exit status 1, aborting

···

On Aug 2, 2017, at 3:33 PM, no-reply@swift.org wrote:

[FAILURE] oss-swift-incremental-RA-linux-ubuntu-16_10 [#4985]

Build URL: https://ci.swift.org/job/oss-swift-incremental-RA-linux-ubuntu-16_10/4985/
Project: oss-swift-incremental-RA-linux-ubuntu-16_10
Date of build: Wed, 02 Aug 2017 15:14:56 -0700
Build duration: 19 min
Tests:

Name: Swift(linux-x86_64)
Failed: 0 test(s), Passed: 9709 test(s), Total: 9709 test(s)
Name: Swift-Unit
Failed: 0 test(s), Passed: 442 test(s), Total: 442 test(s)

Changes

Commit 3279cf5cedd897705370379a1184cc85daefad31 by Ben Langmuir:
[code-completion] Add Bool type context for if/guard/while conditions

edit: test/IDE/complete_stmt_controlling_expr.swift
edit: test/SourceKit/CodeComplete/complete_literals.swift
edit: lib/IDE/CodeCompletion.cpp
edit: test/IDE/complete_keywords.swift

Commit bb12abf527069cc9015aec0b79e403b8288b9955 by Ian Partridge:
Fix Notification API signatures to match Darwin

edit: Foundation/NotificationQueue.swift
edit: Foundation/Notification.swift
edit: Foundation/NSNotification.swift

I found the PR here:
https://github.com/apple/swift-corelibs-foundation/pull/1153

And reverted here to see if I can unblock PR testing.
https://github.com/apple/swift-corelibs-foundation/pull/1156

-Andy

···

On Aug 2, 2017, at 3:41 PM, Andrew Trick via swift-dev <swift-dev@swift.org> wrote:

Ian, I’m not sure why PR testing didn’t report this failure (is there a PR?). Would you be able to revert to unblock PR testing until this is fixed?

Test Case 'TestNotificationCenter.test_postNotification' started at 2017-08-02 22:33:02.555
/home/buildnode/jenkins/workspace/oss-swift-incremental-RA-linux-ubuntu-16_10/swift/utils/build-script-impl: line 261: 36420 Segmentation fault "$@"
/home/buildnode/jenkins/workspace/oss-swift-incremental-RA-linux-ubuntu-16_10/swift/utils/build-script: fatal error: command terminated with a non-zero exit status 139, aborting
/home/buildnode/jenkins/workspace/oss-swift-incremental-RA-linux-ubuntu-16_10/swift/utils/build-script: fatal error: command terminated with a non-zero exit status 1, aborting

On Aug 2, 2017, at 3:33 PM, no-reply@swift.org <mailto:no-reply@swift.org> wrote:

[FAILURE] oss-swift-incremental-RA-linux-ubuntu-16_10 [#4985]

Build URL: https://ci.swift.org/job/oss-swift-incremental-RA-linux-ubuntu-16_10/4985/
Project: oss-swift-incremental-RA-linux-ubuntu-16_10
Date of build: Wed, 02 Aug 2017 15:14:56 -0700
Build duration: 19 min
Tests:

Name: Swift(linux-x86_64)
Failed: 0 test(s), Passed: 9709 test(s), Total: 9709 test(s)
Name: Swift-Unit
Failed: 0 test(s), Passed: 442 test(s), Total: 442 test(s)

Changes

Commit 3279cf5cedd897705370379a1184cc85daefad31 by Ben Langmuir:
[code-completion] Add Bool type context for if/guard/while conditions

edit: test/IDE/complete_stmt_controlling_expr.swift
edit: test/SourceKit/CodeComplete/complete_literals.swift
edit: lib/IDE/CodeCompletion.cpp
edit: test/IDE/complete_keywords.swift

Commit bb12abf527069cc9015aec0b79e403b8288b9955 by Ian Partridge:
Fix Notification API signatures to match Darwin

edit: Foundation/NotificationQueue.swift
edit: Foundation/Notification.swift
edit: Foundation/NSNotification.swift

_______________________________________________
swift-dev mailing list
swift-dev@swift.org
https://lists.swift.org/mailman/listinfo/swift-dev

Terms of Service

Privacy Policy

Cookie Policy