[Swift CI] Build Failure: 0. OSS - Swift Incremental RA - Ubuntu 16.10 (master) #425

Test Case 'TestURLSession.test_concurrentRequests' started at 2017-09-06 19:43:55.444
/home/buildnode/jenkins/workspace/oss-swift-incremental-RA-linux-ubuntu-16_10/swift/utils/build-script-impl: line 262: 25147 Segmentation fault "$@“

Thanks,
Mishal Shah

···

On Sep 6, 2017, at 12:43 PM, no-reply@swift.org wrote:

[FAILURE] oss-swift-incremental-RA-linux-ubuntu-16_10 [#425]

Build URL: https://ci.swift.org/job/oss-swift-incremental-RA-linux-ubuntu-16_10/425/
Project: oss-swift-incremental-RA-linux-ubuntu-16_10
Date of build: Wed, 06 Sep 2017 14:30:20 -0500
Build duration: 14 min
Tests:

Name: Swift(linux-x86_64)
Failed: 0 test(s), Passed: 9867 test(s), Total: 9867 test(s)
Name: Swift-Unit
Failed: 0 test(s), Passed: 443 test(s), Total: 443 test(s)

Changes

Commit efceb8acc18c40af70649db8684266933591b35a by aschwaighofer:
Run optimize for size tests (Osize) on the bots

edit: utils/build-presets.ini

Cannot be related to my commit. I did however see this test failing intermittently.

···

On Sep 6, 2017, at 12:48 PM, Mishal Shah <mishal_shah@apple.com> wrote:

Test Case 'TestURLSession.test_concurrentRequests' started at 2017-09-06 19:43:55.444
/home/buildnode/jenkins/workspace/oss-swift-incremental-RA-linux-ubuntu-16_10/swift/utils/build-script-impl: line 262: 25147 Segmentation fault "$@“

Thanks,
Mishal Shah

On Sep 6, 2017, at 12:43 PM, no-reply@swift.org <mailto:no-reply@swift.org> wrote:

[FAILURE] oss-swift-incremental-RA-linux-ubuntu-16_10 [#425]

Build URL: https://ci.swift.org/job/oss-swift-incremental-RA-linux-ubuntu-16_10/425/
Project: oss-swift-incremental-RA-linux-ubuntu-16_10
Date of build: Wed, 06 Sep 2017 14:30:20 -0500
Build duration: 14 min
Tests:

Name: Swift(linux-x86_64)
Failed: 0 test(s), Passed: 9867 test(s), Total: 9867 test(s)
Name: Swift-Unit
Failed: 0 test(s), Passed: 443 test(s), Total: 443 test(s)

Changes

Commit efceb8acc18c40af70649db8684266933591b35a by aschwaighofer:
Run optimize for size tests (Osize) on the bots

edit: utils/build-presets.ini

For example, an the same failure occurred earlier here:

https://ci.swift.org/job/oss-swift-incremental-RA-linux-ubuntu-16_10/422/console

···

On Sep 6, 2017, at 12:54 PM, Arnold Schwaighofer <aschwaighofer@apple.com> wrote:

Cannot be related to my commit. I did however see this test failing intermittently.

On Sep 6, 2017, at 12:48 PM, Mishal Shah <mishal_shah@apple.com <mailto:mishal_shah@apple.com>> wrote:

Test Case 'TestURLSession.test_concurrentRequests' started at 2017-09-06 19:43:55.444
/home/buildnode/jenkins/workspace/oss-swift-incremental-RA-linux-ubuntu-16_10/swift/utils/build-script-impl: line 262: 25147 Segmentation fault "$@“

Thanks,
Mishal Shah

On Sep 6, 2017, at 12:43 PM, no-reply@swift.org <mailto:no-reply@swift.org> wrote:

[FAILURE] oss-swift-incremental-RA-linux-ubuntu-16_10 [#425]

Build URL: https://ci.swift.org/job/oss-swift-incremental-RA-linux-ubuntu-16_10/425/
Project: oss-swift-incremental-RA-linux-ubuntu-16_10
Date of build: Wed, 06 Sep 2017 14:30:20 -0500
Build duration: 14 min
Tests:

Name: Swift(linux-x86_64)
Failed: 0 test(s), Passed: 9867 test(s), Total: 9867 test(s)
Name: Swift-Unit
Failed: 0 test(s), Passed: 443 test(s), Total: 443 test(s)

Changes

Commit efceb8acc18c40af70649db8684266933591b35a by aschwaighofer:
Run optimize for size tests (Osize) on the bots

edit: utils/build-presets.ini