[Swift CI] Build Failure: 0. OSS - Swift Incremental RA - Ubuntu 16.10 (master) #3783


(Joe Shajrawi) #1

/home/buildnode/jenkins/workspace/oss-swift-incremental-RA-linux-ubuntu-16_10/swiftpm/Tests/CommandsTests/PackageToolTests.swift:75: error: PackageToolTests.testUpdate : XCTAssertEqual failed: ("["1.2.3"]") is not equal to ("["1.2.3", "1.2.4"]") -
Test Case 'PackageToolTests.testUpdate' failed (2.066 seconds)

Argyrios, could your commit be responsible for this?

Regards,
—Joe |  | :e-mail: shajrawi@apple.com <mailto:shajrawi@apple.com> | :iphone:(+1) 408-930-5203

···

On May 20, 2017, at 15:29, no-reply@swift.org wrote:

[FAILURE] oss-swift-incremental-RA-linux-ubuntu-16_10 [#3783]

Build URL: https://ci.swift.org/job/oss-swift-incremental-RA-linux-ubuntu-16_10/3783/
Project: oss-swift-incremental-RA-linux-ubuntu-16_10
Date of build: Sat, 20 May 2017 15:04:37 -0700
Build duration: 24 min
Identified problems:

Compile Error: This build failed because of a compile error. Below is a list of all errors in the build log:
Indication 1 <https://ci.swift.org//job/oss-swift-incremental-RA-linux-ubuntu-16_10/3783/consoleFull#-1870230880ee1a197b-acac-4b17-83cf-a53b95139a76>
Tests:

Name: Swift(linux-x86_64)
Failed: 0 test(s), Passed: 9424 test(s), Total: 9424 test(s)
Name: Swift-Unit
Failed: 0 test(s), Passed: 432 test(s), Total: 432 test(s)

Changes

Commit 492ad6e7067cf06fb1dbd456bed0e13e94645445 by Argyrios Kyrtzidis:
[index] Fix forward declarations interfering with USR generation of

edit: lib/AST/DeclBase.cpp
edit: include/clang/AST/DeclBase.h
edit: lib/Index/IndexSymbol.cpp
edit: test/Index/Core/external-source-symbol-attr.m
edit: lib/Index/USRGeneration.cpp
edit: tools/libclang/CIndex.cpp


(Daniel Dunbar) #2

I strongly suspect the answer is no.

+Ankit

- Daniel

···

On May 20, 2017, at 7:43 PM, Joe Shajrawi via swift-dev <swift-dev@swift.org> wrote:

/home/buildnode/jenkins/workspace/oss-swift-incremental-RA-linux-ubuntu-16_10/swiftpm/Tests/CommandsTests/PackageToolTests.swift:75: error: PackageToolTests.testUpdate : XCTAssertEqual failed: ("["1.2.3"]") is not equal to ("["1.2.3", "1.2.4"]") -
Test Case 'PackageToolTests.testUpdate' failed (2.066 seconds)

Argyrios, could your commit be responsible for this?

Regards,
—Joe |  | :e-mail: shajrawi@apple.com <mailto:shajrawi@apple.com> | :iphone:(+1) 408-930-5203

On May 20, 2017, at 15:29, no-reply@swift.org <mailto:no-reply@swift.org> wrote:

[FAILURE] oss-swift-incremental-RA-linux-ubuntu-16_10 [#3783]

Build URL: https://ci.swift.org/job/oss-swift-incremental-RA-linux-ubuntu-16_10/3783/
Project: oss-swift-incremental-RA-linux-ubuntu-16_10
Date of build: Sat, 20 May 2017 15:04:37 -0700
Build duration: 24 min
Identified problems:

Compile Error: This build failed because of a compile error. Below is a list of all errors in the build log:
Indication 1 <https://ci.swift.org//job/oss-swift-incremental-RA-linux-ubuntu-16_10/3783/consoleFull#-1870230880ee1a197b-acac-4b17-83cf-a53b95139a76>
Tests:

Name: Swift(linux-x86_64)
Failed: 0 test(s), Passed: 9424 test(s), Total: 9424 test(s)
Name: Swift-Unit
Failed: 0 test(s), Passed: 432 test(s), Total: 432 test(s)

Changes

Commit 492ad6e7067cf06fb1dbd456bed0e13e94645445 by Argyrios Kyrtzidis:
[index] Fix forward declarations interfering with USR generation of

edit: lib/AST/DeclBase.cpp
edit: include/clang/AST/DeclBase.h
edit: lib/Index/IndexSymbol.cpp
edit: test/Index/Core/external-source-symbol-attr.m
edit: lib/Index/USRGeneration.cpp
edit: tools/libclang/CIndex.cpp

_______________________________________________
swift-dev mailing list
swift-dev@swift.org
https://lists.swift.org/mailman/listinfo/swift-dev


(Ankit Aggarwal) #3

Reverting the change in swiftpm https://github.com/apple/swift-package-manager/pull/1200

···

On 21-May-2017, at 10:08 AM, Daniel Dunbar <daniel_dunbar@apple.com> wrote:

I strongly suspect the answer is no.

+Ankit

- Daniel

On May 20, 2017, at 7:43 PM, Joe Shajrawi via swift-dev <swift-dev@swift.org <mailto:swift-dev@swift.org>> wrote:

/home/buildnode/jenkins/workspace/oss-swift-incremental-RA-linux-ubuntu-16_10/swiftpm/Tests/CommandsTests/PackageToolTests.swift:75: error: PackageToolTests.testUpdate : XCTAssertEqual failed: ("["1.2.3"]") is not equal to ("["1.2.3", "1.2.4"]") -
Test Case 'PackageToolTests.testUpdate' failed (2.066 seconds)

Argyrios, could your commit be responsible for this?

Regards,
—Joe |  | :e-mail: shajrawi@apple.com <mailto:shajrawi@apple.com> | :iphone:(+1) 408-930-5203

On May 20, 2017, at 15:29, no-reply@swift.org <mailto:no-reply@swift.org> wrote:

[FAILURE] oss-swift-incremental-RA-linux-ubuntu-16_10 [#3783]

Build URL: https://ci.swift.org/job/oss-swift-incremental-RA-linux-ubuntu-16_10/3783/
Project: oss-swift-incremental-RA-linux-ubuntu-16_10
Date of build: Sat, 20 May 2017 15:04:37 -0700
Build duration: 24 min
Identified problems:

Compile Error: This build failed because of a compile error. Below is a list of all errors in the build log:
Indication 1 <https://ci.swift.org//job/oss-swift-incremental-RA-linux-ubuntu-16_10/3783/consoleFull#-1870230880ee1a197b-acac-4b17-83cf-a53b95139a76>
Tests:

Name: Swift(linux-x86_64)
Failed: 0 test(s), Passed: 9424 test(s), Total: 9424 test(s)
Name: Swift-Unit
Failed: 0 test(s), Passed: 432 test(s), Total: 432 test(s)

Changes

Commit 492ad6e7067cf06fb1dbd456bed0e13e94645445 by Argyrios Kyrtzidis:
[index] Fix forward declarations interfering with USR generation of

edit: lib/AST/DeclBase.cpp
edit: include/clang/AST/DeclBase.h
edit: lib/Index/IndexSymbol.cpp
edit: test/Index/Core/external-source-symbol-attr.m
edit: lib/Index/USRGeneration.cpp
edit: tools/libclang/CIndex.cpp

_______________________________________________
swift-dev mailing list
swift-dev@swift.org <mailto:swift-dev@swift.org>
https://lists.swift.org/mailman/listinfo/swift-dev