[Swift CI] Build Failure: 0. OSS - Swift Incremental RA - Ubuntu 16.10 (master) #3748


(Michael Ilseman) #1

Roman, any chance this is related?

16_10/buildbot_incremental/foundation-linux-x86_64/TestFoundation/TestFoundation: undefined symbol: _T0s27_allocateUninitializedArraySayxG_BptBwlFs5UInt8V_Tgq5

···

On May 19, 2017, at 7:40 AM, no-reply@swift.org wrote:

[FAILURE] oss-swift-incremental-RA-linux-ubuntu-16_10 [#3748]

Build URL: https://ci.swift.org/job/oss-swift-incremental-RA-linux-ubuntu-16_10/3748/
Project: oss-swift-incremental-RA-linux-ubuntu-16_10
Date of build: Fri, 19 May 2017 07:10:32 -0700
Build duration: 29 min
Tests:

Name: Swift(linux-x86_64)
Failed: 0 test(s), Passed: 9413 test(s), Total: 9413 test(s)
Name: Swift-Unit
Failed: 0 test(s), Passed: 432 test(s), Total: 432 test(s)

Changes

Commit 3fcd6f40c8c4f00108c9af1a142439b2b62da0c9 by Roman Levenstein:
[sil-inliner] Respect the @inline(__always) and @_transparent even if

edit: lib/SILOptimizer/Utils/PerformanceInlinerUtils.cpp
edit: lib/SILOptimizer/Transforms/PerformanceInliner.cpp

Commit 116581f2c53fe2bf41a29181b0598838eb3b1f53 by Roman Levenstein:
[sil-inliner] Transparent functions should be inlined by the performance

edit: lib/SILOptimizer/Transforms/PerformanceInliner.cpp

Commit 96672b64efe5725ea0bb7044d8bed74266677218 by Roman Levenstein:
[sil-inliner] Update tests for the inlining of generics

edit: test/SILGen/collection_cast_crash.swift
edit: test/SILOptimizer/inline_generics.sil
edit: test/SILOptimizer/performance_inliner.sil


(Roman Levenstein) #2

Roman, any chance this is related?

16_10/buildbot_incremental/foundation-linux-x86_64/TestFoundation/TestFoundation: undefined symbol: _T0s27_allocateUninitializedArraySayxG_BptBwlFs5UInt8V_Tgq5

I haven’t seen it during testing. Can we try with a clean build?

-Roman

···

On May 19, 2017, at 7:48 AM, Michael Ilseman <milseman@apple.com> wrote:

On May 19, 2017, at 7:40 AM, no-reply@swift.org <mailto:no-reply@swift.org> wrote:

[FAILURE] oss-swift-incremental-RA-linux-ubuntu-16_10 [#3748]

Build URL: https://ci.swift.org/job/oss-swift-incremental-RA-linux-ubuntu-16_10/3748/
Project: oss-swift-incremental-RA-linux-ubuntu-16_10
Date of build: Fri, 19 May 2017 07:10:32 -0700
Build duration: 29 min
Tests:

Name: Swift(linux-x86_64)
Failed: 0 test(s), Passed: 9413 test(s), Total: 9413 test(s)
Name: Swift-Unit
Failed: 0 test(s), Passed: 432 test(s), Total: 432 test(s)

Changes

Commit 3fcd6f40c8c4f00108c9af1a142439b2b62da0c9 by Roman Levenstein:
[sil-inliner] Respect the @inline(__always) and @_transparent even if

edit: lib/SILOptimizer/Utils/PerformanceInlinerUtils.cpp
edit: lib/SILOptimizer/Transforms/PerformanceInliner.cpp

Commit 116581f2c53fe2bf41a29181b0598838eb3b1f53 by Roman Levenstein:
[sil-inliner] Transparent functions should be inlined by the performance

edit: lib/SILOptimizer/Transforms/PerformanceInliner.cpp

Commit 96672b64efe5725ea0bb7044d8bed74266677218 by Roman Levenstein:
[sil-inliner] Update tests for the inlining of generics

edit: test/SILGen/collection_cast_crash.swift
edit: test/SILOptimizer/inline_generics.sil
edit: test/SILOptimizer/performance_inliner.sil


(Michael Ilseman) #3

Mishal, could you either clean or show me how?

···

On May 19, 2017, at 7:52 AM, Roman Levenstein <rlevenstein@apple.com> wrote:

On May 19, 2017, at 7:48 AM, Michael Ilseman <milseman@apple.com <mailto:milseman@apple.com>> wrote:

Roman, any chance this is related?

16_10/buildbot_incremental/foundation-linux-x86_64/TestFoundation/TestFoundation: undefined symbol: _T0s27_allocateUninitializedArraySayxG_BptBwlFs5UInt8V_Tgq5

I haven’t seen it during testing. Can we try with a clean build?

-Roman

On May 19, 2017, at 7:40 AM, no-reply@swift.org <mailto:no-reply@swift.org> wrote:

[FAILURE] oss-swift-incremental-RA-linux-ubuntu-16_10 [#3748]

Build URL: https://ci.swift.org/job/oss-swift-incremental-RA-linux-ubuntu-16_10/3748/
Project: oss-swift-incremental-RA-linux-ubuntu-16_10
Date of build: Fri, 19 May 2017 07:10:32 -0700
Build duration: 29 min
Tests:

Name: Swift(linux-x86_64)
Failed: 0 test(s), Passed: 9413 test(s), Total: 9413 test(s)
Name: Swift-Unit
Failed: 0 test(s), Passed: 432 test(s), Total: 432 test(s)

Changes

Commit 3fcd6f40c8c4f00108c9af1a142439b2b62da0c9 by Roman Levenstein:
[sil-inliner] Respect the @inline(__always) and @_transparent even if

edit: lib/SILOptimizer/Utils/PerformanceInlinerUtils.cpp
edit: lib/SILOptimizer/Transforms/PerformanceInliner.cpp

Commit 116581f2c53fe2bf41a29181b0598838eb3b1f53 by Roman Levenstein:
[sil-inliner] Transparent functions should be inlined by the performance

edit: lib/SILOptimizer/Transforms/PerformanceInliner.cpp

Commit 96672b64efe5725ea0bb7044d8bed74266677218 by Roman Levenstein:
[sil-inliner] Update tests for the inlining of generics

edit: test/SILGen/collection_cast_crash.swift
edit: test/SILOptimizer/inline_generics.sil
edit: test/SILOptimizer/performance_inliner.sil


(Joe Shajrawi) #4

Done - I just cleaned the public linux bots. Mishal showed me how yesterday. Hopefully I did it right :slight_smile:

Regards,
—Joe |  | :e-mail: shajrawi@apple.com | :iphone:(+1) 408-930-5203

···

On May 19, 2017, at 7:55 AM, Michael Ilseman <milseman@apple.com> wrote:

Mishal, could you either clean or show me how?

On May 19, 2017, at 7:52 AM, Roman Levenstein <rlevenstein@apple.com <mailto:rlevenstein@apple.com>> wrote:

On May 19, 2017, at 7:48 AM, Michael Ilseman <milseman@apple.com <mailto:milseman@apple.com>> wrote:

Roman, any chance this is related?

16_10/buildbot_incremental/foundation-linux-x86_64/TestFoundation/TestFoundation: undefined symbol: _T0s27_allocateUninitializedArraySayxG_BptBwlFs5UInt8V_Tgq5

I haven’t seen it during testing. Can we try with a clean build?

-Roman

On May 19, 2017, at 7:40 AM, no-reply@swift.org <mailto:no-reply@swift.org> wrote:

[FAILURE] oss-swift-incremental-RA-linux-ubuntu-16_10 [#3748]

Build URL: https://ci.swift.org/job/oss-swift-incremental-RA-linux-ubuntu-16_10/3748/
Project: oss-swift-incremental-RA-linux-ubuntu-16_10
Date of build: Fri, 19 May 2017 07:10:32 -0700
Build duration: 29 min
Tests:

Name: Swift(linux-x86_64)
Failed: 0 test(s), Passed: 9413 test(s), Total: 9413 test(s)
Name: Swift-Unit
Failed: 0 test(s), Passed: 432 test(s), Total: 432 test(s)

Changes

Commit 3fcd6f40c8c4f00108c9af1a142439b2b62da0c9 by Roman Levenstein:
[sil-inliner] Respect the @inline(__always) and @_transparent even if

edit: lib/SILOptimizer/Utils/PerformanceInlinerUtils.cpp
edit: lib/SILOptimizer/Transforms/PerformanceInliner.cpp

Commit 116581f2c53fe2bf41a29181b0598838eb3b1f53 by Roman Levenstein:
[sil-inliner] Transparent functions should be inlined by the performance

edit: lib/SILOptimizer/Transforms/PerformanceInliner.cpp

Commit 96672b64efe5725ea0bb7044d8bed74266677218 by Roman Levenstein:
[sil-inliner] Update tests for the inlining of generics

edit: test/SILGen/collection_cast_crash.swift
edit: test/SILOptimizer/inline_generics.sil
edit: test/SILOptimizer/performance_inliner.sil


(Mishal Shah) #5

Thanks Joe for taking care of this!

···

On May 19, 2017, at 10:14 AM, Joe Shajrawi <shajrawi@apple.com> wrote:

Done - I just cleaned the public linux bots. Mishal showed me how yesterday. Hopefully I did it right :slight_smile:

Regards,
—Joe |  | :e-mail: shajrawi@apple.com <mailto:shajrawi@apple.com> | :iphone:(+1) 408-930-5203

On May 19, 2017, at 7:55 AM, Michael Ilseman <milseman@apple.com <mailto:milseman@apple.com>> wrote:

Mishal, could you either clean or show me how?

On May 19, 2017, at 7:52 AM, Roman Levenstein <rlevenstein@apple.com <mailto:rlevenstein@apple.com>> wrote:

On May 19, 2017, at 7:48 AM, Michael Ilseman <milseman@apple.com <mailto:milseman@apple.com>> wrote:

Roman, any chance this is related?

16_10/buildbot_incremental/foundation-linux-x86_64/TestFoundation/TestFoundation: undefined symbol: _T0s27_allocateUninitializedArraySayxG_BptBwlFs5UInt8V_Tgq5

I haven’t seen it during testing. Can we try with a clean build?

-Roman

On May 19, 2017, at 7:40 AM, no-reply@swift.org <mailto:no-reply@swift.org> wrote:

[FAILURE] oss-swift-incremental-RA-linux-ubuntu-16_10 [#3748]

Build URL: https://ci.swift.org/job/oss-swift-incremental-RA-linux-ubuntu-16_10/3748/
Project: oss-swift-incremental-RA-linux-ubuntu-16_10
Date of build: Fri, 19 May 2017 07:10:32 -0700
Build duration: 29 min
Tests:

Name: Swift(linux-x86_64)
Failed: 0 test(s), Passed: 9413 test(s), Total: 9413 test(s)
Name: Swift-Unit
Failed: 0 test(s), Passed: 432 test(s), Total: 432 test(s)

Changes

Commit 3fcd6f40c8c4f00108c9af1a142439b2b62da0c9 by Roman Levenstein:
[sil-inliner] Respect the @inline(__always) and @_transparent even if

edit: lib/SILOptimizer/Utils/PerformanceInlinerUtils.cpp
edit: lib/SILOptimizer/Transforms/PerformanceInliner.cpp

Commit 116581f2c53fe2bf41a29181b0598838eb3b1f53 by Roman Levenstein:
[sil-inliner] Transparent functions should be inlined by the performance

edit: lib/SILOptimizer/Transforms/PerformanceInliner.cpp

Commit 96672b64efe5725ea0bb7044d8bed74266677218 by Roman Levenstein:
[sil-inliner] Update tests for the inlining of generics

edit: test/SILGen/collection_cast_crash.swift
edit: test/SILOptimizer/inline_generics.sil
edit: test/SILOptimizer/performance_inliner.sil