[Swift CI] Build Failure: 0. OSS - Swift Incremental RA - Ubuntu 16.10 (master) #2819

Report

[FAILURE] oss-swift-incremental-RA-linux-ubuntu-16_10 [#2819]

Build URL:
https://ci.swift.org/job/oss-swift-incremental-RA-linux-ubuntu-16_10/2819/
Project:
oss-swift-incremental-RA-linux-ubuntu-16_10
Date of build:
Tue, 27 Feb 2018 02:50:23 -0600
Build duration:
1 hr 11 min

Identified problems:

  • Regression test failed: This build failed because a regression test in the test suite FAILed. Below is a list of all errors:

Tests:

Name: Swift(linux-x86_64)
Failed: 0 test(s), Passed: 10276 test(s), Total: 10276 test(s)
Name: Swift-Unit
Failed: 1 test(s), Passed: 501 test(s), Total: 502 test(s)

This looks like it’s probably a timeout:

******************** TEST ‘Swift-Unit :: SourceKit/SwiftLang/./SourceKitSwiftLangTests/EditTest.DiagsAfterEdit’ FAILED ********************
03:53:50 Note: Google Test filter = EditTest.DiagsAfterEdit
03:53:50 [==========] Running 1 test from 1 test case.
03:53:50 [----------] Global test environment set-up.
03:53:50 [----------] 1 test from EditTest
03:53:50 [ RUN ] EditTest.DiagsAfterEdit
03:53:50 /home/buildnode/jenkins/workspace/oss-swift-incremental-RA-linux-ubuntu-16_10/swift/unittests/SourceKit/SwiftLang/EditingTest.cpp:211: Failure
03:53:50 Value of: expired
03:53:50 Actual: true
03:53:50 Expected: false
03:53:50 [ FAILED ] EditTest.DiagsAfterEdit (15394 ms)
03:53:50 [----------] 1 test from EditTest (15394 ms total)
03:53:50
03:53:50 [----------] Global test environment tear-down
03:53:50 [==========] 1 test from 1 test case ran. (15464 ms total)
03:53:50 [ PASSED ] 0 tests.
03:53:50 [ FAILED ] 1 test, listed below:
03:53:50 [ FAILED ] EditTest.DiagsAfterEdit
03:53:50
03:53:50 1 FAILED TEST
03:53:50
03:53:50 ********************

Huon