[Swift CI] Build Failure: 0. OSS - Swift Incremental RA - Ubuntu 16.10 (master) #2744

Report

[FAILURE] oss-swift-incremental-RA-linux-ubuntu-16_10 [#2744]

Build URL:
https://ci.swift.org/job/oss-swift-incremental-RA-linux-ubuntu-16_10/2744/
Project:
oss-swift-incremental-RA-linux-ubuntu-16_10
Date of build:
Mon, 19 Feb 2018 17:54:51 -0600
Build duration:
32 min

Identified problems:

  • Compile Error: This build failed because of a compile error. Below is a list of all errors in the build log:

Tests:

Name: Swift(linux-x86_64)
Failed: 0 test(s), Passed: 10259 test(s), Total: 10259 test(s)
Name: Swift-Unit
Failed: 0 test(s), Passed: 503 test(s), Total: 503 test(s)

Changes

  • Commit 5ccb4f797e1c4a7d7760f2d791fb2485d92234fc by aprantl:
    build-script: Pass path to just-built libddispatch and Foundation to

    • edit: utils/build-script-impl

That looks like a flakey swiftpm test?

Test Suite ‘Selected tests’ started at 2018-02-20 00:26:31.277
Test Suite ‘RepositoryManagerTests’ started at 2018-02-20 00:26:31.279
Test Case ‘RepositoryManagerTests.testBasics’ started at 2018-02-20 00:26:31.279
/home/buildnode/jenkins/workspace/oss-swift-incremental-RA-linux-ubuntu-16_10/swiftpm/Tests/SourceControlTests/RepositoryManagerTests.swift:199: error: RepositoryManagerTests.testBasics : Asynchronous wait failed - Exceeded timeout of 1.0 seconds, with unfulfilled expectations: Repository lookup expectation, Repository lookup expectation
/home/buildnode/jenkins/workspace/oss-swift-incremental-RA-linux-ubuntu-16_10/swiftpm/Tests/SourceControlTests/RepositoryManagerTests.swift:206: error: RepositoryManagerTests.testBasics : failed - Unexpected nil value
/home/buildnode/jenkins/workspace/oss-swift-incremental-RA-linux-ubuntu-16_10/swiftpm/Tests/SourceControlTests/RepositoryManagerTests.swift:210: error: RepositoryManagerTests.testBasics : XCTAssertEqual failed: (“0”) is not equal to (“1”) - /home/buildnode/jenkins/workspace/oss-swift-incremental-RA-linux-ubuntu-16_10/swiftpm/Tests/SourceControlTests/RepositoryManagerTests.swift:211: error: RepositoryManagerTests.testBasics : XCTAssertEqual failed: ("[]") is not equal to ("[dummy]") - /home/buildnode/jenkins/workspace/oss-swift-incremental-RA-linux-ubuntu-16_10/swiftpm/Tests/SourceControlTests/RepositoryManagerTests.swift:212: error: RepositoryManagerTests.testBasics : XCTAssertEqual failed: ("[]") is not equal to ("[dummy]") - Test Case ‘RepositoryManagerTests.testBasics’ failed (3.864 seconds)
Test Suite ‘RepositoryManagerTests’ failed at 2018-02-20 00:26:35.143
Executed 1 test, with 5 failures (0 unexpected) in 3.864 (3.864) seconds
Test Suite ‘Selected tests’ failed at 2018-02-20 00:26:35.143
Executed 1 test, with 5 failures (0 unexpected) in 3.864 (3.864) seconds
— bootstrap: error: tests failed with exit status 1